book_id,title,author_or_editor,isbn,publisher,source,num_red,place,copyright_year,categories,audience,area,kind_of,media,thumbnail_url,info_url,reference_url,reference_no,notes,note_ii,status,borrower_id,due_date,date_created,date_modified,created_by,modified_by
2895,"Српско коло",1903-1910,Загреб,,,,"Универзитетска библиотека ""Светозар Марковић""",,,General,"Централна Хрватска","Штампана издања","2 3",,,http://www.unilib.rs/istorijske-novine/pregled?category=PREWWI&newspaper=UB_00002,,"Лист је излазио у Загребу од 1903. до 1929. са прекидом 1915-1918. Као издавач јавља се друштво “Српско коло”, а одговорни уредник био је Буде Будисављевић, кога 1912. замењује Дејан Бира, Иван Растовчан и Гојко Стојановић. Када је лист 1919. обновљен, њиме су руководила браћа Прибићевић, уз сарадњу Душана Иванчевића и Милана Грчића. Пред укидање 1929. уредништво се сели у Београд. Излазио је недељно и са “Србобраном” је делио уређивачки одбор. Осим вести о свакодневном привредном и културно-просветном животу у Угарској и шире, увек се посебно обраћала пажња савременим проблемима и догађајима, као што је Анексија Босне и Херцеговине и загребачки “велеиздајнички процес”. Цензура је често остављала белине у овом листу. У првим годинама излажења било је више прилога о здрављу, животним причама, као и књижевних прилога.","Претраживо у тексту",,"NO ACCESS",,,,arhivar3,Uzi
13942,Балкан,1886-1887,Загреб,,,,"Национална и свеучилишна књижница Загреб",,,General,"Централна Хрватска","Штампана издања","2 3",,,http://dnc.nsk.hr/newspapers/LibraryTitle.aspx?id=2f857cee-886d-4d00-9da5-46f3e38ea441,,"Лист за јавне прилике, поуку, народну привреду и забаву. На латиници.","Претраживо у тексту",,"NO ACCESS",,,,arhivar1,Uzi
13948,"Царско-краљевске службене народне новине",1853-1860,Загреб,,,,"Национална и свеучилишна књижница Загреб",,,General,"Централна Хрватска","Штампана издања","2 3",,,http://dnc.nsk.hr/newspapers/LibraryTitle.aspx?id=268fd2d1-188d-4ec0-b57d-fd4ba60cfa54,,"Народне новине излазиле су под насловом Царско краљевске службене народне новине у раздобљу од 1835. до 1860. године. То је једини наслов Народних новина који садржи израз службени и описује намену овог дневног листа. На латиници.","Претраживо у тексту",,"NO ACCESS",,,,arhivar1,Uzi
13950,"Даница хорватска, славонска и далматинска",1843-1848,Загреб,,,,"Национална и свеучилишна књижница Загреб",,,General,"Централна Хрватска","Штампана издања","2 3",,,http://dnc.nsk.hr/newspapers/LibraryTitle.aspx?id=d2e4bfc8-03b0-455f-bebc-2f6debc26ab2,,"Од јануара 1843, одлуком Државне конференције у Бечу, забрањено је коришћење илирског имена и сваке политичке и културне делатности у духу илиризма, па је Даница илирска променила име у Даница хорватска, славонска и далматинска. На латиници.","Претраживо у тексту",,"NO ACCESS",,,,arhivar1,Uzi
13951,"Даница илирска",1836-1843,Загреб,,,,"Национална и свеучилишна књижница Загреб",,,General,"Централна Хрватска","Штампана издања","2 3",,,http://dnc.nsk.hr/newspapers/LibraryTitle.aspx?id=13814fb3-98f0-4288-a955-ab222228233d,,"Године 1836. лист Danicza horvatzka, slavonzka y dalmatinzka мења наслову у Даница илирска. Новине су писане на штокавском наречју и писане новим правописом, доносиле су забавне, поучне, књижевне прилоге и историјске догађаје. Од 1843. после забране илирског имена, новине излазе под старим насловом - Даница хорватска, славонска и далматинска.",,,"NO ACCESS",,,,arhivar1,Uzi
13953,"Народне новине",1861-,Загреб,,,,"Национална и свеучилишна књижница Загреб",,,General,"Централна Хрватска","Штампана издања","2 3",,,http://dnc.nsk.hr/newspapers/LibraryTitle.aspx?id=c7c83bb6-e9df-4ee4-90ba-870dee5f99eb&y=1885&m=1&d=12,,"Од 1861. излазе без дела наслова ""царско-краљевске"", а уместо хабсбуршког грба, у наслову имају хрватски грб. Од те године до данас наслов се није значајније мењао. На латиници.","Претраживо у тексту",,"NO ACCESS",,,,arhivar1,Uzi
13954,"Новине далматинско-херватско-славонске",1847-1849,Загреб,,,,"Национална и свеучилишна књижница Загреб",,,General,"Централна Хрватска","Штампана издања","2 3",,,http://dnc.nsk.hr/newspapers/LibraryTitle.aspx?id=3d45cc35-e613-455d-880c-a505f696dc07&y=1847&m=3&d=31,,"Новине под овим насловом излазе до 1949. кад постају службени лист и мењају наслов у Народне новине. На латиници.","Претраживо у тексту",,"NO ACCESS",,,,arhivar1,Uzi
13955,"Даница илирска",1849-1867,Загреб,,,,"Национална и свеучилишна књижница Загреб",,,General,"Централна Хрватска","Штампана издања","2 3",,,http://dnc.nsk.hr/newspapers/LibraryTitle.aspx?id=1366795e-d3ea-4e8c-9c01-c6c114a15e14&y=1863&m=1&d=10,,"Од 1849. лист се вратио овом називу, под којим је излазио у периоду од 18336. до 1843. У међувремену носио назив Даница хорватска, славонска и далматинска. На латиници.","Претраживо у тексту",,"NO ACCESS",,,,arhivar1,Uzi
13956,"Danicza horvatzka, slavonzka y dalmatinzka",1835,Загреб,,,,"Национална и свеучилишна књижница Загреб",,,General,"Централна Хрватска","Штампана издања","2 3",,,http://dnc.nsk.hr/newspapers/LibraryTitle.aspx?id=547f90de-4774-42a1-859c-d2b443e1a6cf&y=1835&m=9&d=26,,"Први хрватски културни и књижевни лист, који од 1836. мења назив у Даница илирска.Од 25. јула 1835. новине уводе штокавштину као књижевни језик. На латиници.","Претраживо у тексту",,"NO ACCESS",,,,arhivar1,Uzi
13958,"Дубровачке кундурице",1937,Загреб,,,,"Национална и свеучилишна књижница Загреб",,,General,"Централна Хрватска","Штампана издања","2 3",,,http://dnc.nsk.hr/newspapers/LibraryTitle.aspx?id=7f33ac51-3d11-4ad3-babe-faa16e74d753&y=1937&m=1&d=9,,,"Претраживо у тексту",,"NO ACCESS",,,,arhivar1,Uzi
13966,Херватска,1871,Загреб,,,,"Национална и свеучилишна књижница Загреб",,,General,"Централна Хрватска","Штампана издања","2 3",,,http://dnc.nsk.hr/newspapers/LibraryTitle.aspx?id=be757d1a-a331-4bc2-8bdb-1470e75fb329&y=1871&m=2&d=5,,"Једне од првих потпуно политичких новина у Хрватској. Новине су подржавале Странку права. На латиници.","Претраживо у тексту",,"NO ACCESS",,,,arhivar1,Uzi
13969,"Хрватске новости",1909-1914,Загреб,,,,"Национална и свеучилишна књижница Загреб",,,General,"Централна Хрватска","Штампана издања","2 3",,,http://dnc.nsk.hr/newspapers/LibraryTitle.aspx?id=f8280373-5efd-44de-a60c-f57bc477793d&y=1914&m=1&d=9,,"Дневне новине које су издавале присташе Јосипа Франка.","Претраживо у тексту",,"NO ACCESS",,,,arhivar1,Uzi
13971,"Хрватски народ",1892-1914,Загреб,,,,"Национална и свеучилишна књижница Загреб",,,General,"Централна Хрватска","Штампана издања","2 3",,,http://dnc.nsk.hr/newspapers/LibraryTitle.aspx?id=9433f6d4-13ee-4034-b09e-a0335d9e83fe&y=1914&m=3&d=5,,"Новине основала Хрватска странка права.","Претраживо у тексту",,"NO ACCESS",,,,arhivar1,Uzi
13972,"Хрватски раднички глас",1897-1899,Загреб,,,,"Национална и свеучилишна књижница Загреб",,,General,"Централна Хрватска","Штампана издања","2 3",,,http://dnc.nsk.hr/newspapers/LibraryTitle.aspx?id=9b097f9f-e3cf-4a5a-b4d2-92344b754cb5&y=1897&m=1&d=15,,"Гласило радничких клубова странке права: лист за политику те промицање и заштићивање интереса хрватских радника и обртника","Претраживо у тексту",,"NO ACCESS",,,,arhivar1,Uzi
13973,"Илирске народне новине",1836-1843,Загреб,,,,"Национална и свеучилишна књижница Загреб",,,General,"Централна Хрватска","Штампана издања","2 3",,,http://dnc.nsk.hr/newspapers/LibraryTitle.aspx?id=1a7779a8-ef40-4ec3-a675-2372c673a3c3&y=1841&m=4&d=20,,"До 1836. године новине носиле назив Novine horvatzke. После забране илирског имена, 1843. мењају назив у Народне новине.","Претраживо у тексту",,"NO ACCESS",,,,arhivar1,Uzi
13976,"Јутарњи лист",1912-1941,Загреб,,,,"Национална и свеучилишна књижница Загреб",,,General,"Централна Хрватска","Штампана издања","2 3",,,,,"Најпре локално усмерен лист, а током Првог светског рата доносио и ратне вести. После 1919. извештава о домаћим и међународним политичким и друштвеним збивањима.","Претраживо у тексту",,"NO ACCESS",,,,arhivar1,Uzi
13988,"Личка слога",1934-1941,Загреб,,,,"Национална и свеучилишна књижница Загреб",,,General,"Централна Хрватска","Штампана издања","2 3",,,http://dnc.nsk.hr/newspapers/LibraryTitle.aspx?id=8feba580-9862-41fc-a263-06e5edac28b7&y=1935&m=6&d=21,,"Новине за господарство и просвету","Претраживо у тексту",,"NO ACCESS",,,,arhivar1,Uzi
13991,"Лички Хрват",1937-1938,Загреб,,,,"Национална и свеучилишна књижница Загреб",,,General,"Централна Хрватска","Штампана издања","2 3",,,http://dnc.nsk.hr/newspapers/LibraryTitle.aspx?id=0bbc40b2-bd01-4497-b5f7-f07b5da5e427&y=1938&m=3&d=26,,,"Претраживо у тексту",,"NO ACCESS",,,,arhivar1,Uzi
13992,"Мали лист",1914-1915,Загреб,,,,"Национална и свеучилишна књижница Загреб",,,General,"Централна Хрватска","Штампана издања","2 3",,,http://dnc.nsk.hr/newspapers/LibraryTitle.aspx?id=a31a8442-ab5b-4b0f-98cd-d48e0df78fbd&y=1914&m=12&d=6,,"Дневни лист","Претраживо у тексту",,"NO ACCESS",,,,arhivar1,Uzi
13994,Народ,1872-1873,Загреб,,,,"Национална и свеучилишна књижница Загреб",,,General,"Централна Хрватска","Штампана издања","2 3",,,http://dnc.nsk.hr/newspapers/LibraryTitle.aspx?id=d1ffd8d1-d27b-4008-b587-284c891d23ab&y=1872&m=6&d=3,,,"Претраживо у тексту",,"NO ACCESS",,,,arhivar1,Uzi
13995,"Народне новине",1843-1844,Загреб,,,,"Национална и свеучилишна књижница Загреб",,,General,"Централна Хрватска","Штампана издања","2 3",,,http://dnc.nsk.hr/newspapers/LibraryTitle.aspx?id=71336578-31e2-4a78-9015-0498b0065ac6&y=1843&m=3&d=18,,"Новине излазиле под овим називом од 1843. до 1844. Излазиле су два пута недељно. У марту 1844. мењају наслов у Новине хорватско-славонско-далматинске.","Претраживо у тексту",,"NO ACCESS",,,,arhivar1,Uzi
13996,"Народне новине",1849-1953,Загреб,,,,"Национална и свеучилишна књижница Загреб",,,General,"Централна Хрватска","Штампана издања","2 3",,,http://dnc.nsk.hr/newspapers/LibraryTitle.aspx?id=aa9c639d-4206-42f1-b637-76b8a8bfea04&y=1850&m=4&d=19,,"Под овим називом излазе до 1853. кад мењају назив у Царско-краљевске службене народне новине.","Претраживо у тексту",,"NO ACCESS",,,,arhivar1,Uzi
13999,"Новине далматиско-херватско-славонске",1847-1849,Загреб,,,,"Национална и свеучилишна књижница Загреб",,,General,"Централна Хрватска","Штампана издања","2 3",,,http://dnc.nsk.hr/newspapers/LibraryTitle.aspx?id=3d45cc35-e613-455d-880c-a505f696dc07&y=1847&m=5&d=1,,"Од 1849. новине мењају назив у Народне новине.","Претраживо у тексту",,"NO ACCESS",,,,arhivar1,Uzi
14000,"Новине хорватско-славонско-далматинске",1844-1846,Загреб,,,,"Национална и свеучилишна књижница Загреб",,,General,"Централна Хрватска","Штампана издања","2 3",,,http://dnc.nsk.hr/newspapers/LibraryTitle.aspx?id=8c1b3c60-9c3b-4745-bcb7-96ce8e6081b5&y=1845&m=3&d=19,,"Од јануара 1847. новине мењају назив у Новине далматинско-херватско-славонске.","Претраживо у тексту",,"NO ACCESS",,,,arhivar1,Uzi
14001,"Novine horvatzke",1835,Загреб,,,,"Национална и свеучилишна књижница Загреб",,,General,"Централна Хрватска","Штампана издања","2 3",,,http://dnc.nsk.hr/newspapers/LibraryTitle.aspx?id=5e41e64d-d273-4447-9d82-98989ed95486&y=1835&m=10&d=3,,"Од 1836. мењају назив у Илирске народне новине, а после забране илирског имена у Народне новине.","Претраживо у тексту",,"NO ACCESS",,,,arhivar1,Uzi
14002,Новости,1907-1941,Загреб,,,,"Национална и свеучилишна књижница Загреб",,,General,"Централна Хрватска","Штампана издања","2 3",,,http://dnc.nsk.hr/newspapers/LibraryTitle.aspx?id=92c0ac95-09bc-4f00-ac9e-1b67ed3f5f69&y=1914&m=3&d=19,,"Дневни лист. Југословенска штампа.","Претраживо у тексту",,"NO ACCESS",,,,arhivar1,Uzi
14003,"Обзор (јутарње издање)",1905-1920,Загреб,,,,"Национална и свеучилишна књижница Загреб",,,General,"Централна Хрватска","Штампана издања","2 3",,,http://dnc.nsk.hr/newspapers/LibraryTitle.aspx?id=f07bdb26-e0d8-4671-86de-a45b42f554eb&y=1914&m=10&d=18,,"Дневне новине.","Претраживо у тексту",,"NO ACCESS",,,,arhivar1,Uzi
14004,"Обзор (поподневно издање)",1905-1919,Загреб,,,,"Национална и свеучилишна књижница Загреб",,,General,"Централна Хрватска","Штампана издања","2 3",,,http://dnc.nsk.hr/newspapers/LibraryTitle.aspx?id=63bd99aa-fdf4-42ea-ab11-509cd6f51145&y=1914&m=5&d=20,,"Дневне новине.","Претраживо у тексту",,"NO ACCESS",,,,arhivar1,Uzi
14005,Обзор,1871-1881,Загреб,,,,"Национална и свеучилишна књижница Загреб",,,General,"Централна Хрватска","Штампана издања","2 3",,,http://dnc.nsk.hr/newspapers/LibraryTitle.aspx?id=51a20ae8-ea54-4831-aefc-fe4f35f5f684&y=1871&m=8&d=9,,"Претходни назив Браник (Сисак)","Претраживо у тексту",,"NO ACCESS",,,,arhivar1,Uzi
14006,"Опћински управник",1909-1941,Загреб,,,,"Национална и свеучилишна књижница Загреб",,,General,"Централна Хрватска","Штампана издања","2 3",,,http://dnc.nsk.hr/newspapers/LibraryTitle.aspx?id=e3ebbc43-5bb0-4f20-9acd-370274650804&y=1914&m=7&d=18,,"Недељно гласило Земаљског друштва опћ. чиновника Краљ. Хрватске и Славоније за унапређење опћ. управе и сталишких интереса","Претраживо у тексту",,"NO ACCESS",,,,arhivar1,Uzi
14009,Позор,1860-1867,Загреб,,,,"Национална и свеучилишна књижница Загреб",,,General,"Централна Хрватска","Штампана издања","2 3",,,http://dnc.nsk.hr/newspapers/LibraryTitle.aspx?id=cc74c691-c1ac-4cfc-b9ad-0bddb5261c8c&y=1860&m=12&d=24,,"Дневни лист","Претраживо у тексту",,"NO ACCESS",,,,arhivar1,Uzi
14011,"Прави пријатељ народа",1891-1897,Загреб,,,,"Национална и свеучилишна књижница Загреб",,,General,"Централна Хрватска","Штампана издања","2 3",,,,http://dnc.nsk.hr/newspapers/Lib,"Лист унионистичке странке који је почео излазити 1891. насупрот обзорашком Пријатељу народа. Доноси практичне савете из свих грана привреде, а уређиван је у педагошком тону.","Претраживо у тексту",,"NO ACCESS",,,,arhivar1,Uzi
14017,"Радничка слога",1914,Загреб,,,,"Национална и свеучилишна књижница Загреб",,,General,"Централна Хрватска","Штампана издања","2 3",,,http://dnc.nsk.hr/newspapers/LibraryTitle.aspx?id=0e4e10f7-c936-4ee4-bef4-29b691da277e&y=1914&m=7&d=23,,"Гласило радништва животних намирница Хрватске и Славоније","Претраживо у тексту",,"NO ACCESS",,,,arhivar1,Uzi
14018,"Раднички гласник",1887-1889,Загреб,,,,"Национална и свеучилишна књижница Загреб",,,General,"Централна Хрватска","Штампана издања","2 3",,,http://dnc.nsk.hr/newspapers/LibraryTitle.aspx?id=8fe4497c-675f-4f89-8351-2d773d93feb2&y=1887&m=1&d=15,,,"Претраживо у тексту",,"NO ACCESS",,,,arhivar1,Uzi
14019,"Раднички пријатељ",1874-1875,Загреб,,,,"Национална и свеучилишна књижница Загреб",,,General,"Централна Хрватска","Штампана издања","2 3",,,http://dnc.nsk.hr/newspapers/LibraryTitle.aspx?id=2a09fa38-f205-4488-aaca-4baa649dfb72&y=1875&m=4&d=11,,,"Претраживо у тексту",,"NO ACCESS",,,,arhivar1,Uzi
14020,"Саборске новине",1848,Загреб,,,,"Национална и свеучилишна књижница Загреб",,,General,"Централна Хрватска","Штампана издања","2 3",,,http://dnc.nsk.hr/newspapers/LibraryTitle.aspx?id=cef4461b-6892-4a78-9957-56ac6fdecb4a&y=1848&m=6&d=28,,,"Претраживо у тексту",,"NO ACCESS",,,,arhivar1,Uzi
14023,"Славенски југ",1948-1950,Загреб,,,,"Национална и свеучилишна књижница Загреб",,,General,"Централна Хрватска","Штампана издања","2 3",,,http://dnc.nsk.hr/newspapers/LibraryTitle.aspx?id=87a538ac-bda4-4038-a664-de64488e47b3&y=1849&m=4&d=5,,"Излазио три пута недељно. Наредни назив листа био је Југославенске новине.","Претраживо у тексту",,"NO ACCESS",,,,arhivar1,Uzi
14026,Слога,1870-1871,Загреб,,,,"Национална и свеучилишна књижница Загреб",,,General,"Централна Хрватска","Штампана издања","2 3",,,http://dnc.nsk.hr/newspapers/LibraryTitle.aspx?id=0022c352-d888-4be5-acb0-1ea3bcbf9ef1&y=1870&m=9&d=3,,,"Претраживо у тексту",,"NO ACCESS",,,,arhivar1,Uzi
14030,Старчевићанац,1897-1901,Загреб,,,,"Национална и свеучилишна књижница Загреб",,,General,"Централна Хрватска","Штампана издања","2 3",,,http://dnc.nsk.hr/newspapers/LibraryTitle.aspx?id=1189d447-f497-4609-9568-ab34c88e47ab&y=1908&m=5&d=9,,"Новине за хрватски пук. Излазио полумесечно.","Претраживо у тексту",,"NO ACCESS",,,,arhivar1,Uzi
14037,"Женски лист",1925-1938,Загреб,,,,"Национална и свеучилишна књижница Загреб",,,General,"Централна Хрватска","Штампана издања","2 3",,,http://dnc.nsk.hr/newspapers/LibraryTitle.aspx?id=c0c31c8e-0793-48cb-97e0-2eb0e36f718e&y=1932&m=5&d=1,,"Лист за моду, забаву и кућанство","Претраживо у тексту",,"NO ACCESS",,,,arhivar1,Uzi
14038,"Жидовска смотра",1906-1914,Загреб,,,,"Национална и свеучилишна књижница Загреб",,,General,"Централна Хрватска","Штампана издања","2 3",,,http://dnc.nsk.hr/newspapers/LibraryTitle.aspx?id=e8306e3e-09c6-466f-a0fd-b13280c01f83&y=1914&m=4&d=29,,"Гласило јеврејске заједнице, излазило полумесечно.","Претраживо у тексту",,"NO ACCESS",,,,arhivar1,Uzi
14039,"Живила Хрватска",1898-1899,Загреб,,,,"Национална и свеучилишна књижница Загреб",,,General,"Централна Хрватска","Штампана издања","2 3",,,http://dnc.nsk.hr/newspapers/LibraryTitle.aspx?id=249cf629-9dae-4fd4-bacf-122ebd135c4a&y=1899&m=12&d=14,,"Пучке новине чисте странке права","Претраживо у тексту",,"NO ACCESS",,,,arhivar1,Uzi
14044,"Матична књига умрлих",1873-1900,Лепавина,Соколовац,,,"Државни архив у Вараждину",,"Матице Српске православне цркве",,"Централна Хрватска","Црквене матичне књиге",,,,,,,,,"NO ACCESS",,,,Uzi,Uzi
3341,"Матична књига рођених",1766-1792,Болч,Фаркашевац,,R1766-1792,"Хрватски државни архив",,"Матице Српске православне цркве",,"Централна Хрватска","Црквене матичне књиге",,FS0,https://www.poreklo.rs/2020/04/05/hrvatski-drzavni-arhiv/,,HRA-00395-1,,,,"NO ACCESS",,,,arhivar1,Uzi
4750,"Матична књига рођених",1768-1813,"Мрзло Поље",,,R1768-1813,"Архив епархије крижевачке",,Гркокатолици,,"Централна Хрватска","Црквене матичне књиге",,,,,HRA-01594-1,,,,"NO ACCESS",,,,arhivar1,Uzi
3344,"Матична књига рођених",1793-1822,Болч,Фаркашевац,,R1793-1822,"Хрватски државни архив",,"Матице Српске православне цркве",,"Централна Хрватска","Црквене матичне књиге",,FS0,https://www.poreklo.rs/2020/04/05/hrvatski-drzavni-arhiv/,,HRA-00396-1,,,,"NO ACCESS",,,,arhivar1,Uzi
4756,"Матична књига рођених",1810-1881,"Мрзло Поље",,,R1810-1881,Непознато,,Гркокатолици,,"Централна Хрватска","Црквене матичне књиге",,,,,HRA-01598-1,,,,"NO ACCESS",,,,arhivar1,Uzi
3340,"Матична књига рођених",1822-1834,Болч,Фаркашевац,,R1822-1834,"Хрватски државни архив",,"Матице Српске православне цркве",,"Централна Хрватска","Црквене матичне књиге",,FS0,https://www.poreklo.rs/2020/04/05/hrvatski-drzavni-arhiv/,,HRA-00394-1,,,,"NO ACCESS",,,,arhivar1,Uzi
4986,"Матична књига рођених",1828-1852,Пака,Чаглин,,R1828-1852,"Хрватски државни архив",,"Матице Српске православне цркве",,"Централна Хрватска","Црквене матичне књиге",,,https://www.poreklo.rs/2020/04/05/hrvatski-drzavni-arhiv/,,HRA-01790-1,,,,"NO ACCESS",,,,arhivar1,Uzi
3339,"Матична књига рођених",1833-1848,Болч,Фаркашевац,,R1833-1848,"Хрватски државни архив",,"Матице Српске православне цркве",,"Централна Хрватска","Црквене матичне књиге",,FS0,https://www.poreklo.rs/2020/04/05/hrvatski-drzavni-arhiv/,,HRA-00393-1,,,,"NO ACCESS",,,,arhivar1,Uzi
5943,"Матична књига рођених",1834-1853,Војаковац,Крижевци,,R1834-1853,"Хрватски државни архив",,"Матице Српске православне цркве",,"Централна Хрватска","Црквене матичне књиге",,FS1,https://www.poreklo.rs/2020/04/05/hrvatski-drzavni-arhiv/,,HRA-02595-1,,,,"NO ACCESS",,,,arhivar1,Uzi
5553,"Матична књига рођених",1845-1875,Соколовац,Соколовац,,R1845-1875,"Државни архив у Вараждину",,"Матице Српске православне цркве",,"Централна Хрватска","Црквене матичне књиге",,,,,HRA-02270-1,,,,"NO ACCESS",,,,arhivar1,Uzi
5848,"Матична књига рођених",1847-1862,"Велики Поганац",Расиња,,R1847-1862,"Државни архив у Вараждину",,"Матице Српске православне цркве",,"Централна Хрватска","Црквене матичне књиге",,,,,HRA-02507-1,,,,"NO ACCESS",,,,arhivar1,Uzi
3348,"Матична књига рођених",1848-1869,Болч,Фаркашевац,,R1848-1869,"Хрватски државни архив",,"Матице Српске православне цркве",,"Централна Хрватска","Црквене матичне књиге",,FS0,https://www.poreklo.rs/2020/04/05/hrvatski-drzavni-arhiv/,,HRA-00400-1,,,,"NO ACCESS",,,,arhivar1,Uzi
3349,"Матична књига рођених",1848-1869,Болч,Фаркашевац,,R1848-1869,"Хрватски државни архив",,"Матице Српске православне цркве",,"Централна Хрватска","Црквене матичне књиге",,FS0,https://www.poreklo.rs/2020/04/05/hrvatski-drzavni-arhiv/,,HRA-00401-1,,,,"NO ACCESS",,,,arhivar1,Uzi
5193,"Матична књига рођених",1850-1877,Плавшинац,"Новиград Подравски",,R1850-1877,"Државни архив у Вараждину",,"Матице Српске православне цркве",,"Централна Хрватска","Црквене матичне књиге",,,,,HRA-01979-1,,,,"NO ACCESS",,,,arhivar1,Uzi
5092,"Матична књига рођених",1853-1871,Војаковац,Крижевци,,R1853-1871,"Државни архив у Бјеловару",,"Матице Српске православне цркве",,"Централна Хрватска","Црквене матичне књиге",,FS1,,,HRA-01888-1,,,,"NO ACCESS",,,,arhivar1,Uzi
6102,"Матична књига рођених",1856-1880,Загреб,Загреб,,R1856-1880,"Хрватски државни архив",,"Матице Српске православне цркве",,"Централна Хрватска","Црквене матичне књиге",,,https://www.poreklo.rs/2020/04/05/hrvatski-drzavni-arhiv/,,HRA-02728-1,,,,"NO ACCESS",,,,arhivar1,Uzi
4745,"Матична књига рођених",1858-1879,"Мрзло Поље",,,R1858-1879,Непознато,,Гркокатолици,,"Централна Хрватска","Црквене матичне књиге",,,,,HRA-01589-1,"Матица је 05.10.1998. предана на чување Хрватском државном архиву, а до тада се чувала у матичном уреду.",,,"NO ACCESS",,,,arhivar1,Uzi
5842,"Матична књига рођених",1858-1889,"Велика Мучна",Соколовац,,R1858-1889,"Државни архив у Вараждину",,"Матице Српске православне цркве",,"Централна Хрватска","Црквене матичне књиге",,,,,HRA-02503-1,,,,"NO ACCESS",,,,arhivar1,Uzi
5843,"Матична књига рођених",1858-1889,"Велика Мучна",Соколовац,,R1858-1889,"Државни архив у Вараждину",,"Матице Српске православне цркве",,"Централна Хрватска","Црквене матичне књиге",,,,,HRA-02504-1,,,,"NO ACCESS",,,,arhivar1,Uzi
5844,"Матична књига рођених",1858-1889,"Велика Мучна",Соколовац,,R1858-1889,"Државни архив у Вараждину",,"Матице Српске православне цркве",,"Централна Хрватска","Црквене матичне књиге",,,,,HRA-02505-1,,,,"NO ACCESS",,,,arhivar1,Uzi
5849,"Матична књига рођених",1862-1875,"Велики Поганац",Расиња,,R1862-1875,"Државни архив у Вараждину",,"Матице Српске православне цркве",,"Централна Хрватска","Црквене матичне књиге",,,,,HRA-02508-1,,,,"NO ACCESS",,,,arhivar1,Uzi
5850,"Матична књига рођених",1862-1875,"Велики Поганац",Расиња,,R1862-1875,"Државни архив у Вараждину",,"Матице Српске православне цркве",,"Централна Хрватска","Црквене матичне књиге",,,,,HRA-02509-1,,,,"NO ACCESS",,,,arhivar1,Uzi
5851,"Матична књига рођених",1862-1875,"Велики Поганац",Расиња,,R1862-1875,"Државни архив у Вараждину",,"Матице Српске православне цркве",,"Централна Хрватска","Црквене матичне књиге",,,,,HRA-02510-1,,,,"NO ACCESS",,,,arhivar1,Uzi
3271,"Матична књига рођених",1867-1883,Болфан,Лудбрег,,R1867-1883,"Државни архив у Вараждину",,"Матице Српске православне цркве",,"Централна Хрватска","Црквене матичне књиге",,FS1,,,HRA-00347-1,,,,"NO ACCESS",,,,arhivar1,Uzi
3257,"Матична књига рођених",1869-1894,Болч,Фаркашевац,,R1869-1894,"Државни архив у Бјеловару",,"Матице Српске православне цркве",,"Централна Хрватска","Црквене матичне књиге",,FS1,,,HRA-00333-1,,,,"NO ACCESS",,,,arhivar1,Uzi
5091,"Матична књига рођених",1871-1888,Војаковац,Крижевци,,R1871-1888,"Државни архив у Бјеловару",,"Матице Српске православне цркве",,"Централна Хрватска","Црквене матичне књиге",,FS1,,,HRA-01887-1,,,,"NO ACCESS",,,,arhivar1,Uzi
3350,"Матична књига рођених",1876-1879,Болч,Фаркашевац,,R1876-1879,"Хрватски државни архив",,"Матице Српске православне цркве",,"Централна Хрватска","Црквене матичне књиге",,FS0,https://www.poreklo.rs/2020/04/05/hrvatski-drzavni-arhiv/,,HRA-00402-1,,,,"NO ACCESS",,,,arhivar1,Uzi
5194,"Матична књига рођених",1877-1895,Плавшинац,"Новиград Подравски",,R1877-1895,"Државни архив у Вараждину",,"Матице Српске православне цркве",,"Централна Хрватска","Црквене матичне књиге",,,,,HRA-01980-1,,,,"NO ACCESS",,,,arhivar1,Uzi
12945,"Матична књига рођених",1878-1878,Тржић,Тоуњ,,R1878-1878,"Државни архив Карловац",,"Матице Српске православне цркве",,"Централна Хрватска","Црквене матичне књиге",,,https://www.poreklo.rs/2020/04/05/drzavni-arhiv-u-karlovcu-hrvatska/,,HRA-09364-1,,,,"NO ACCESS",,,,arhivar1,Uzi