book_id,title,author_or_editor,isbn,publisher,source,num_red,place,copyright_year,categories,audience,area,kind_of,media,thumbnail_url,info_url,reference_url,reference_no,notes,note_ii,status,borrower_id,due_date,date_created,date_modified,created_by,modified_by
1992,,,,"Бачка Топола",,,"општина Бачка Топола",,,,Војводина,Остало,,,,,,,,,"NO ACCESS",,,,,
1993,,,,"Мали Иђош",,,"општина Мали Иђош",,,,Војводина,Остало,,,,,,,,,"NO ACCESS",,,,,
1774,"све три врсте",1718-1949,,Сомбор,,,"Архив Сомбор",,,,Војводина,Остало,,,https://www.poreklo.rs/2020/04/10/istorijski-arhiv-sombora/,,,"несређен фонд, без детаља",,,"NO ACCESS",,,,,
1516,,1744-1769,Бечеј,Бечеј,,,"Историјски архив Сента",,,,Војводина,Остало,,,https://www.poreklo.rs/2020/04/10/istorijski-arhiv-senta/,,,парохија,,,"NO ACCESS",,,,,
1509,,1744-1899,Бечеј,Бечеј,,,"Историјски архив Сента",,,,Војводина,Остало,,,https://www.poreklo.rs/2020/04/10/istorijski-arhiv-senta/,,,парохија,,,"NO ACCESS",,,,,
1510,,1744-1899,Бечеј,Бечеј,,,"Историјски архив Сента",,,,Војводина,Остало,,,https://www.poreklo.rs/2020/04/10/istorijski-arhiv-senta/,,,парохија,,,"NO ACCESS",,,,,
1538,,1747-1777,"Бачко Петрово село",Бечеј,,,"Историјски архив Сента",,,,Војводина,Остало,,,https://www.poreklo.rs/2020/04/10/istorijski-arhiv-senta/,,,,,,"NO ACCESS",,,,,
751,,1747-1889,Остојићево,Чока,,,"Историјски архив Кикинда",,,,Војводина,Остало,,,https://www.poreklo.rs/2020/04/10/istorijski-arhiv-kikinda/,,,,,,"NO ACCESS",,,,,
741,,1768-1895,"Велико Средиште",Вршац,,,"Историјски архив Бела Црква",,,,Војводина,Остало,Дигитализовано,,https://www.poreklo.rs/2020/04/10/istorijski-arhiv-bela-crkva/,,,,,,"NO ACCESS",,,,,
744,,1768-1895,Војводинци,Вршац,,,"Историјски архив Бела Црква",,,,Војводина,Остало,Дигитализовано,,https://www.poreklo.rs/2020/04/10/istorijski-arhiv-bela-crkva/,,,,,,"NO ACCESS",,,,,
732,,1768-1896,"Велики Гај",Пландиште,,,"Историјски архив Бела Црква",,,,Војводина,Остало,Дигитализовано,,https://www.poreklo.rs/2020/04/10/istorijski-arhiv-bela-crkva/,,,,,,"NO ACCESS",,,,,
1495,,1770-1773,Бечеј,Бечеј,,,"Историјски архив Сента",,,,Војводина,Остало,,,https://www.poreklo.rs/2020/04/10/istorijski-arhiv-senta/,,,парохија,,,"NO ACCESS",,,,,
1574,,1773-1781,Мол,Ада,,,"Историјски архив Сента",,,,Војводина,Остало,,,https://www.poreklo.rs/2020/04/10/istorijski-arhiv-senta/,,,,,,"NO ACCESS",,,,,
1564,,1773-1789,Кањижа,Кањижа,,,"Историјски архив Сента",,,,Војводина,Остало,,,https://www.poreklo.rs/2020/04/10/istorijski-arhiv-senta/,,,парохија,,,"NO ACCESS",,,,,
1494,,1774-1771,Бечеј,Бечеј,,,"Историјски архив Сента",,,,Војводина,Остало,,,https://www.poreklo.rs/2020/04/10/istorijski-arhiv-senta/,,,парохија,,,"NO ACCESS",,,,,
1496,,1774-1796,Бечеј,Бечеј,,,"Историјски архив Сента",,,,Војводина,Остало,,,https://www.poreklo.rs/2020/04/10/istorijski-arhiv-senta/,,,парохија,,,"NO ACCESS",,,,,
1497,,1777-1783,Бечеј,Бечеј,,,"Историјски архив Сента",,,,Војводина,Остало,,,https://www.poreklo.rs/2020/04/10/istorijski-arhiv-senta/,,,парохија,,,"NO ACCESS",,,,,
1565,,1777-1787,Кањижа,Кањижа,,,"Историјски архив Сента",,,,Војводина,Остало,,,https://www.poreklo.rs/2020/04/10/istorijski-arhiv-senta/,,,парохија,,,"NO ACCESS",,,,,
1570,,1777-1816,Кањижа,Кањижа,,,"Историјски архив Сента",,,,Војводина,Остало,,,https://www.poreklo.rs/2020/04/10/istorijski-arhiv-senta/,,,парохија,,,"NO ACCESS",,,,,
1539,,1777-1827,"Бачко Петрово село",Бечеј,,,"Историјски архив Сента",,,,Војводина,Остало,,,https://www.poreklo.rs/2020/04/10/istorijski-arhiv-senta/,,,,,,"NO ACCESS",,,,,
720,,1777-1895,"Банатска Паланка","Бела Црква",,,"Историјски архив Бела Црква",,,,Војводина,Остало,Дигитализовано,,https://www.poreklo.rs/2020/04/10/istorijski-arhiv-bela-crkva/,,,,,,"NO ACCESS",,,,,
739,,1777-1905,Павлиш,Вршац,,,"Историјски архив Бела Црква",,,,Војводина,Остало,Дигитализовано,,https://www.poreklo.rs/2020/04/10/istorijski-arhiv-bela-crkva/,,,,,,"NO ACCESS",,,,,
693,"Матична књига рођених",1778-1794,Гај,Ковин,,,"Историјски архив Панчево",,,,Војводина,"Црквене матичне књиге","Микрофилм, Дигитализовано",,https://www.poreklo.rs/2020/04/10/istorijski-arhiv-pancevo/,,,,,,"NO ACCESS",,,,,
726,,1778-1896,Крушчица,"Бела Црква",,,"Историјски архив Бела Црква",,,,Војводина,Остало,Дигитализовано,,https://www.poreklo.rs/2020/04/10/istorijski-arhiv-bela-crkva/,,,,,,"NO ACCESS",,,,,
735,,1778-1949,"Мало Средиште",Вршац,,,"Историјски архив Бела Црква",,,,Војводина,Остало,Дигитализовано,,https://www.poreklo.rs/2020/04/10/istorijski-arhiv-bela-crkva/,,,,,,"NO ACCESS",,,,,
603,"Матична књига рођених",1779-1791,Идвор,Ковачица,,,"Историјски архив Панчево",,,,Војводина,"Црквене матичне књиге","Микрофилм, Дигитализовано",,https://www.poreklo.rs/2020/04/10/istorijski-arhiv-pancevo/,,,,,,"NO ACCESS",,,,,
538,"Матична књига рођених",1779-1792,Омољица,Панчево,,,"Историјски архив Панчево",,,,Војводина,"Црквене матичне књиге","Микрофилм, Дигитализовано",,https://www.poreklo.rs/2020/04/10/istorijski-arhiv-pancevo/,,,,,,"NO ACCESS",,,,,
602,"Матична књига рођених",1779-1792,Селеуш,Алибунар,,,"Историјски архив Панчево",,,,Војводина,"Црквене матичне књиге","Микрофилм, Дигитализовано",,https://www.poreklo.rs/2020/04/10/istorijski-arhiv-pancevo/,,,,,,"NO ACCESS",,,,,
475,"Матична књига умрлих",1779-1797,"Банатски Брестовац",Панчево,,,"Историјски архив Панчево",,,,Војводина,"Црквене матичне књиге","Микрофилм, Дигитализовано",,https://www.poreklo.rs/2020/04/10/istorijski-arhiv-pancevo/,,,,,,"NO ACCESS",,,,,
469,"Матична књига рођених",1779-1798,"Банатски Брестовац",Панчево,,,"Историјски архив Панчево",,,,Војводина,"Црквене матичне књиге","Микрофилм, Дигитализовано",,https://www.poreklo.rs/2020/04/10/istorijski-arhiv-pancevo/,,,,,,"NO ACCESS",,,,,
620,"Матична књига венчаних",1779-1811,Идвор,Ковачица,,,"Историјски архив Панчево",,,,Војводина,"Црквене матичне књиге","Микрофилм, Дигитализовано",,https://www.poreklo.rs/2020/04/10/istorijski-arhiv-pancevo/,,,,,,"NO ACCESS",,,,,
482,"Матична књига венчаних",1779-1821,"Банатски Брестовац",Панчево,,,"Историјски архив Панчево",,,,Војводина,"Црквене матичне књиге","Микрофилм, Дигитализовано",,https://www.poreklo.rs/2020/04/10/istorijski-arhiv-pancevo/,,,,,,"NO ACCESS",,,,,
1498,,1782-1794,Бечеј,Бечеј,,,"Историјски архив Сента",,,,Војводина,Остало,,,https://www.poreklo.rs/2020/04/10/istorijski-arhiv-senta/,,,парохија,,,"NO ACCESS",,,,,
1517,,1783-1798,Бечеј,Бечеј,,,"Историјски архив Сента",,,,Војводина,Остало,,,https://www.poreklo.rs/2020/04/10/istorijski-arhiv-senta/,,,парохија,,,"NO ACCESS",,,,,
1540,,1788-1815,"Бачко Петрово село",Бечеј,,,"Историјски архив Сента",,,,Војводина,Остало,,,https://www.poreklo.rs/2020/04/10/istorijski-arhiv-senta/,,,,,,"NO ACCESS",,,,,
530,"Матична књига венчаних",1789-1812,Долово,Панчево,,,"Историјски архив Панчево",,,,Војводина,"Црквене матичне књиге","Микрофилм, Дигитализовано",,https://www.poreklo.rs/2020/04/10/istorijski-arhiv-pancevo/,,,,,,"NO ACCESS",,,,,
1566,,1789-1846,Кањижа,Кањижа,,,"Историјски архив Сента",,,,Војводина,Остало,,,https://www.poreklo.rs/2020/04/10/istorijski-arhiv-senta/,,,парохија,,,"NO ACCESS",,,,,
502,"Матична књига рођених",1790-1812,Долово,Панчево,,,"Историјски архив Панчево",,,,Војводина,"Црквене матичне књиге","Микрофилм, Дигитализовано",,https://www.poreklo.rs/2020/04/10/istorijski-arhiv-pancevo/,,,,,,"NO ACCESS",,,,,
613,"Матична књига умрлих",1791-1807,Идвор,Ковачица,,,"Историјски архив Панчево",,,,Војводина,"Црквене матичне књиге","Микрофилм, Дигитализовано",,https://www.poreklo.rs/2020/04/10/istorijski-arhiv-pancevo/,,,,,,"NO ACCESS",,,,,
1550,,1791-1837,"Бачко Петрово село",Бечеј,,,"Историјски архив Сента",,,,Војводина,Остало,,,https://www.poreklo.rs/2020/04/10/istorijski-arhiv-senta/,,,,,,"NO ACCESS",,,,,
604,"Матична књига рођених",1792-1800,Идвор,Ковачица,,,"Историјски архив Панчево",,,,Војводина,"Црквене матичне књиге","Микрофилм, Дигитализовано",,https://www.poreklo.rs/2020/04/10/istorijski-arhiv-pancevo/,,,,,,"NO ACCESS",,,,,
724,,1792-1895,Кајтасово,"Бела Црква",,,"Историјски архив Бела Црква",,,,Војводина,Остало,Дигитализовано,,https://www.poreklo.rs/2020/04/10/istorijski-arhiv-bela-crkva/,,,,,,"NO ACCESS",,,,,
485,"Матична књига рођених",1793-1803,"Банатско ново село",Панчево,,,"Историјски архив Панчево",,,,Војводина,"Црквене матичне књиге","Микрофилм, Дигитализовано",,https://www.poreklo.rs/2020/04/10/istorijski-arhiv-pancevo/,,,,,,"NO ACCESS",,,,,
671,"Матична књига рођених",1793-1810,Баваниште,Ковин,,,"Историјски архив Панчево",,,,Војводина,"Црквене матичне књиге","Микрофилм, Дигитализовано",,https://www.poreklo.rs/2020/04/10/istorijski-arhiv-pancevo/,,,,,,"NO ACCESS",,,,,
686,"Матична књига венчаних",1793-1824,Баваниште,Ковин,,,"Историјски архив Панчево",,,,Војводина,"Црквене матичне књиге","Микрофилм, Дигитализовано",,https://www.poreklo.rs/2020/04/10/istorijski-arhiv-pancevo/,,,,,,"NO ACCESS",,,,,
546,"Матична књига умрлих",1793-1825,Омољица,Панчево,,,"Историјски архив Панчево",,,,Војводина,"Црквене матичне књиге","Микрофилм, Дигитализовано",,https://www.poreklo.rs/2020/04/10/istorijski-arhiv-pancevo/,,,,,,"NO ACCESS",,,,,
539,"Матична књига рођених",1793-1829,Омољица,Панчево,,,"Историјски архив Панчево",,,,Војводина,"Црквене матичне књиге","Микрофилм, Дигитализовано",,https://www.poreklo.rs/2020/04/10/istorijski-arhiv-pancevo/,,,,,,"NO ACCESS",,,,,
747,,1793-1896,Загајица,Вршац,,,"Историјски архив Бела Црква",,,,Војводина,Остало,Дигитализовано,,https://www.poreklo.rs/2020/04/10/istorijski-arhiv-bela-crkva/,,,,,,"NO ACCESS",,,,,
1499,,1794-1807,Бечеј,Бечеј,,,"Историјски архив Сента",,,,Војводина,Остало,,,https://www.poreklo.rs/2020/04/10/istorijski-arhiv-senta/,,,парохија,,,"NO ACCESS",,,,,
516,"Матична књига умрлих",1794-1815,Долово,Панчево,,,"Историјски архив Панчево",,,,Војводина,"Црквене матичне књиге","Микрофилм, Дигитализовано",,https://www.poreklo.rs/2020/04/10/istorijski-arhiv-pancevo/,,,,,,"NO ACCESS",,,,,
694,"Матична књига рођених",1794-1823,Гај,Ковин,,,"Историјски архив Панчево",,,,Војводина,"Црквене матичне књиге","Микрофилм, Дигитализовано",,https://www.poreklo.rs/2020/04/10/istorijski-arhiv-pancevo/,,,,,,"NO ACCESS",,,,,
703,"Матична књига венчаних",1794-1823,Гај,Ковин,,,"Историјски архив Панчево",,,,Војводина,"Црквене матичне књиге","Микрофилм, Дигитализовано",,https://www.poreklo.rs/2020/04/10/istorijski-arhiv-pancevo/,,,,,,"NO ACCESS",,,,,
728,,1794-1895,Ватин,"Бела Црква",,,"Историјски архив Бела Црква",,,,Војводина,Остало,Дигитализовано,,https://www.poreklo.rs/2020/04/10/istorijski-arhiv-bela-crkva/,,,,,,"NO ACCESS",,,,,
730,,1794-1895,"Црвена Црква","Бела Црква",,,"Историјски архив Бела Црква",,,,Војводина,Остало,Дигитализовано,,https://www.poreklo.rs/2020/04/10/istorijski-arhiv-bela-crkva/,,,"14 књига",,,"NO ACCESS",,,,,
587,"Матична књига рођених",1796-1818,Старчево,Панчево,,,"Историјски архив Панчево",,,,Војводина,"Црквене матичне књиге","Микрофилм, Дигитализовано",,https://www.poreklo.rs/2020/04/10/istorijski-arhiv-pancevo/,,,,,,"NO ACCESS",,,,,
593,"Матична књига умрлих",1796-1818,Старчево,Панчево,,,"Историјски архив Панчево",,,,Војводина,"Црквене матичне књиге","Микрофилм, Дигитализовано",,https://www.poreklo.rs/2020/04/10/istorijski-arhiv-pancevo/,,,,,,"NO ACCESS",,,,,
597,"Матична књига венчаних",1796-1818,Старчево,Панчево,,,"Историјски архив Панчево",,,,Војводина,"Црквене матичне књиге","Микрофилм, Дигитализовано",,https://www.poreklo.rs/2020/04/10/istorijski-arhiv-pancevo/,,,,,,"NO ACCESS",,,,,
1511,,1796-1828,Бечеј,Бечеј,,,"Историјски архив Сента",,,,Војводина,Остало,,,https://www.poreklo.rs/2020/04/10/istorijski-arhiv-senta/,,,парохија,,,"NO ACCESS",,,,,
476,"Матична књига умрлих",1797-1812,"Банатски Брестовац",Панчево,,,"Историјски архив Панчево",,,,Војводина,"Црквене матичне књиге","Микрофилм, Дигитализовано",,https://www.poreklo.rs/2020/04/10/istorijski-arhiv-pancevo/,,,,,,"NO ACCESS",,,,,
648,"Матична књига рођених",1798-1808,Црепаја,Ковачица,,,"Историјски архив Панчево",,,,Војводина,"Црквене матичне књиге","Микрофилм, Дигитализовано",,https://www.poreklo.rs/2020/04/10/istorijski-arhiv-pancevo/,,,,,,"NO ACCESS",,,,,
470,"Матична књига рођених",1798-1810,"Банатски Брестовац",Панчево,,,"Историјски архив Панчево",,,,Војводина,"Црквене матичне књиге","Микрофилм, Дигитализовано",,https://www.poreklo.rs/2020/04/10/istorijski-arhiv-pancevo/,,,,,,"NO ACCESS",,,,,
1518,,1799-1837,Бечеј,Бечеј,,,"Историјски архив Сента",,,,Војводина,Остало,,,https://www.poreklo.rs/2020/04/10/istorijski-arhiv-senta/,,,парохија,,,"NO ACCESS",,,,,
605,"Матична књига рођених",1801-1812,Идвор,Ковачица,,,"Историјски архив Панчево",,,,Војводина,"Црквене матичне књиге","Микрофилм, Дигитализовано",,https://www.poreklo.rs/2020/04/10/istorijski-arhiv-pancevo/,,,,,,"NO ACCESS",,,,,
486,"Матична књига рођених",1803-1813,"Банатско ново село",Панчево,,,"Историјски архив Панчево",,,,Војводина,"Црквене матичне књиге","Микрофилм, Дигитализовано",,https://www.poreklo.rs/2020/04/10/istorijski-arhiv-pancevo/,,,,,,"NO ACCESS",,,,,
1575,,1803-1825,Мол,Ада,,,"Историјски архив Сента",,,,Војводина,Остало,,,https://www.poreklo.rs/2020/04/10/istorijski-arhiv-senta/,,,,,,"NO ACCESS",,,,,
627,"Матична књига рођених",1805-1813,Самош,Ковачица,,,"Историјски архив Панчево",,,,Војводина,"Црквене матичне књиге","Микрофилм, Дигитализовано",,https://www.poreklo.rs/2020/04/10/istorijski-arhiv-pancevo/,,,,,,"NO ACCESS",,,,,
643,"Матична књига венчаних",1806-1822,Самош,Ковачица,,,"Историјски архив Панчево",,,,Војводина,"Црквене матичне књиге","Микрофилм, Дигитализовано",,https://www.poreklo.rs/2020/04/10/istorijski-arhiv-pancevo/,,,,,,"NO ACCESS",,,,,
635,"Матична књига умрлих",1806-1823,Самош,Ковачица,,,"Историјски архив Панчево",,,,Војводина,"Црквене матичне књиге","Микрофилм, Дигитализовано",,https://www.poreklo.rs/2020/04/10/istorijski-arhiv-pancevo/,,,,,,"NO ACCESS",,,,,
614,"Матична књига умрлих",1807-1826,Идвор,Ковачица,,,"Историјски архив Панчево",,,,Војводина,"Црквене матичне књиге","Микрофилм, Дигитализовано",,https://www.poreklo.rs/2020/04/10/istorijski-arhiv-pancevo/,,,,,,"NO ACCESS",,,,,
1500,,1807-1828,Бечеј,Бечеј,,,"Историјски архив Сента",,,,Војводина,Остало,,,https://www.poreklo.rs/2020/04/10/istorijski-arhiv-senta/,,,парохија,,,"NO ACCESS",,,,,
1585,,1808-1834,Мол,Ада,,,"Историјски архив Сента",,,,Војводина,Остало,,,https://www.poreklo.rs/2020/04/10/istorijski-arhiv-senta/,,,,,,"NO ACCESS",,,,,
649,"Матична књига рођених",1809-1821,Црепаја,Ковачица,,,"Историјски архив Панчево",,,,Војводина,"Црквене матичне књиге","Микрофилм, Дигитализовано",,https://www.poreklo.rs/2020/04/10/istorijski-arhiv-pancevo/,,,,,,"NO ACCESS",,,,,
672,"Матична књига рођених",1810-1824,Баваниште,Ковин,,,"Историјски архив Панчево",,,,Војводина,"Црквене матичне књиге","Микрофилм, Дигитализовано",,https://www.poreklo.rs/2020/04/10/istorijski-arhiv-pancevo/,,,,,,"NO ACCESS",,,,,
621,"Матична књига венчаних",1811-1824,Идвор,Ковачица,,,"Историјски архив Панчево",,,,Војводина,"Црквене матичне књиге","Микрофилм, Дигитализовано",,https://www.poreklo.rs/2020/04/10/istorijski-arhiv-pancevo/,,,,,,"NO ACCESS",,,,,
503,"Матична књига рођених",1812-1821,Долово,Панчево,,,"Историјски архив Панчево",,,,Војводина,"Црквене матичне књиге","Микрофилм, Дигитализовано",,https://www.poreklo.rs/2020/04/10/istorijski-arhiv-pancevo/,,,,,,"NO ACCESS",,,,,
531,"Матична књига венчаних",1812-1821,Долово,Панчево,,,"Историјски архив Панчево",,,,Војводина,"Црквене матичне књиге","Микрофилм, Дигитализовано",,https://www.poreklo.rs/2020/04/10/istorijski-arhiv-pancevo/,,,,,,"NO ACCESS",,,,,
477,"Матична књига умрлих",1812-1822,"Банатски Брестовац",Панчево,,,"Историјски архив Панчево",,,,Војводина,"Црквене матичне књиге","Микрофилм, Дигитализовано",,https://www.poreklo.rs/2020/04/10/istorijski-arhiv-pancevo/,,,,,,"NO ACCESS",,,,,
606,"Матична књига рођених",1812-1829,Идвор,Ковачица,,,"Историјски архив Панчево",,,,Војводина,"Црквене матичне књиге","Микрофилм, Дигитализовано",,https://www.poreklo.rs/2020/04/10/istorijski-arhiv-pancevo/,,,,,,"NO ACCESS",,,,,
628,"Матична књига рођених",1813-1822,Самош,Ковачица,,,"Историјски архив Панчево",,,,Војводина,"Црквене матичне књиге","Микрофилм, Дигитализовано",,https://www.poreklo.rs/2020/04/10/istorijski-arhiv-pancevo/,,,,,,"NO ACCESS",,,,,
495,"Матична књига рођених",1813-1839,Глогоњ,Панчево,,,"Историјски архив Панчево",,,,Војводина,"Црквене матичне књиге","Микрофилм, Дигитализовано",,https://www.poreklo.rs/2020/04/10/istorijski-arhiv-pancevo/,,,,,,"NO ACCESS",,,,,
498,"Матична књига умрлих",1813-1842,Глогоњ,Панчево,,,"Историјски архив Панчево",,,,Војводина,"Црквене матичне књиге","Микрофилм, Дигитализовано",,https://www.poreklo.rs/2020/04/10/istorijski-arhiv-pancevo/,,,,,,"NO ACCESS",,,,,
517,"Матична књига умрлих",1815-1821,Долово,Панчево,,,"Историјски архив Панчево",,,,Војводина,"Црквене матичне књиге","Микрофилм, Дигитализовано",,https://www.poreklo.rs/2020/04/10/istorijski-arhiv-pancevo/,,,,,,"NO ACCESS",,,,,
1541,,1816-1827,"Бачко Петрово село",Бечеј,,,"Историјски архив Сента",,,,Војводина,Остало,,,https://www.poreklo.rs/2020/04/10/istorijski-arhiv-senta/,,,,,,"NO ACCESS",,,,,
588,"Матична књига рођених",1818-1822,Старчево,Панчево,,,"Историјски архив Панчево",,,,Војводина,"Црквене матичне књиге","Микрофилм, Дигитализовано",,https://www.poreklo.rs/2020/04/10/istorijski-arhiv-pancevo/,,,,,,"NO ACCESS",,,,,
598,"Матична књига венчаних",1818-1824,Старчево,Панчево,,,"Историјски архив Панчево",,,,Војводина,"Црквене матичне књиге","Микрофилм, Дигитализовано",,https://www.poreklo.rs/2020/04/10/istorijski-arhiv-pancevo/,,,,,,"NO ACCESS",,,,,
594,"Матична књига умрлих",1818-1826,Старчево,Панчево,,,"Историјски архив Панчево",,,,Војводина,"Црквене матичне књиге","Микрофилм, Дигитализовано",,https://www.poreklo.rs/2020/04/10/istorijski-arhiv-pancevo/,,,,,,"NO ACCESS",,,,,
504,"Матична књига рођених",1821-1830,Долово,Панчево,,,"Историјски архив Панчево",,,,Војводина,"Црквене матичне књиге","Микрофилм, Дигитализовано",,https://www.poreklo.rs/2020/04/10/istorijski-arhiv-pancevo/,,,,,,"NO ACCESS",,,,,
518,"Матична књига умрлих",1821-1830,Долово,Панчево,,,"Историјски архив Панчево",,,,Војводина,"Црквене матичне књиге","Микрофилм, Дигитализовано",,https://www.poreklo.rs/2020/04/10/istorijski-arhiv-pancevo/,,,,,,"NO ACCESS",,,,,
519,"Матична књига умрлих",1821-1830,Долово,Панчево,,,"Историјски архив Панчево",,,,Војводина,"Црквене матичне књиге","Микрофилм, Дигитализовано",,https://www.poreklo.rs/2020/04/10/istorijski-arhiv-pancevo/,,,,,,"NO ACCESS",,,,,
650,"Матична књига рођених",1821-1834,Црепаја,Ковачица,,,"Историјски архив Панчево",,,,Војводина,"Црквене матичне књиге","Микрофилм, Дигитализовано",,https://www.poreklo.rs/2020/04/10/istorijski-arhiv-pancevo/,,,,,,"NO ACCESS",,,,,
657,"Матична књига умрлих",1821-1837,Црепаја,Ковачица,,,"Историјски архив Панчево",,,,Војводина,"Црквене матичне књиге","Микрофилм, Дигитализовано",,https://www.poreklo.rs/2020/04/10/istorijski-arhiv-pancevo/,,,,,,"NO ACCESS",,,,,
658,"Матична књига умрлих",1821-1837,Црепаја,Ковачица,,,"Историјски архив Панчево",,,,Војводина,"Црквене матичне књиге","Микрофилм, Дигитализовано",,https://www.poreklo.rs/2020/04/10/istorijski-arhiv-pancevo/,,,,,,"NO ACCESS",,,,,
532,"Матична књига венчаних",1821-1839,Долово,Панчево,,,"Историјски архив Панчево",,,,Војводина,"Црквене матичне књиге","Микрофилм, Дигитализовано",,https://www.poreklo.rs/2020/04/10/istorijski-arhiv-pancevo/,,,,,,"NO ACCESS",,,,,
533,"Матична књига венчаних",1821-1839,Долово,Панчево,,,"Историјски архив Панчево",,,,Војводина,"Црквене матичне књиге","Микрофилм, Дигитализовано",,https://www.poreklo.rs/2020/04/10/istorijski-arhiv-pancevo/,,,,,,"NO ACCESS",,,,,
663,"Матична књига венчаних",1821-1850,Црепаја,Ковачица,,,"Историјски архив Панчево",,,,Војводина,"Црквене матичне књиге","Микрофилм, Дигитализовано",,https://www.poreklo.rs/2020/04/10/istorijski-arhiv-pancevo/,,,,,,"NO ACCESS",,,,,
629,"Матична књига рођених",1822-1827,Самош,Ковачица,,,"Историјски архив Панчево",,,,Војводина,"Црквене матичне књиге","Микрофилм, Дигитализовано",,https://www.poreklo.rs/2020/04/10/istorijski-arhiv-pancevo/,,,,,,"NO ACCESS",,,,,
471,"Матична књига рођених",1822-1830,"Банатски Брестовац",Панчево,,,"Историјски архив Панчево",,,,Војводина,"Црквене матичне књиге","Микрофилм, Дигитализовано",,https://www.poreklo.rs/2020/04/10/istorijski-arhiv-pancevo/,,,,,,"NO ACCESS",,,,,
478,"Матична књига умрлих",1822-1831,"Банатски Брестовац",Панчево,,,"Историјски архив Панчево",,,,Војводина,"Црквене матичне књиге","Микрофилм, Дигитализовано",,https://www.poreklo.rs/2020/04/10/istorijski-arhiv-pancevo/,,,,,,"NO ACCESS",,,,,
644,"Матична књига венчаних",1822-1838,Самош,Ковачица,,,"Историјски архив Панчево",,,,Војводина,"Црквене матичне књиге","Микрофилм, Дигитализовано",,https://www.poreklo.rs/2020/04/10/istorijski-arhiv-pancevo/,,,,,,"NO ACCESS",,,,,
589,"Матична књига рођених",1822-1839,Старчево,Панчево,,,"Историјски архив Панчево",,,,Војводина,"Црквене матичне књиге","Микрофилм, Дигитализовано",,https://www.poreklo.rs/2020/04/10/istorijski-arhiv-pancevo/,,,,,,"NO ACCESS",,,,,
483,"Матична књига венчаних",1822-1852,"Банатски Брестовац",Панчево,,,"Историјски архив Панчево",,,,Војводина,"Црквене матичне књиге","Микрофилм, Дигитализовано",,https://www.poreklo.rs/2020/04/10/istorijski-arhiv-pancevo/,,,,,,"NO ACCESS",,,,,
636,"Матична књига умрлих",1823-1830,Самош,Ковачица,,,"Историјски архив Панчево",,,,Војводина,"Црквене матичне књиге","Микрофилм, Дигитализовано",,https://www.poreklo.rs/2020/04/10/istorijski-arhiv-pancevo/,,,,,,"NO ACCESS",,,,,
695,"Матична књига рођених",1824-1831,Гај,Ковин,,,"Историјски архив Панчево",,,,Војводина,"Црквене матичне књиге","Микрофилм, Дигитализовано",,https://www.poreklo.rs/2020/04/10/istorijski-arhiv-pancevo/,,,,,,"NO ACCESS",,,,,
700,"Матична књига умрлих",1824-1832,Гај,Ковин,,,"Историјски архив Панчево",,,,Војводина,"Црквене матичне књиге","Микрофилм, Дигитализовано",,https://www.poreklo.rs/2020/04/10/istorijski-arhiv-pancevo/,,,,,,"NO ACCESS",,,,,
704,"Матична књига венчаних",1824-1832,Гај,Ковин,,,"Историјски архив Панчево",,,,Војводина,"Црквене матичне књиге","Микрофилм, Дигитализовано",,https://www.poreklo.rs/2020/04/10/istorijski-arhiv-pancevo/,,,,,,"NO ACCESS",,,,,
707,"Матична књига рођених",1824-1832,Дубовац,Ковин,,,"Историјски архив Панчево",,,,Војводина,"Црквене матичне књиге","Микрофилм, Дигитализовано",,https://www.poreklo.rs/2020/04/10/istorijski-arhiv-pancevo/,,,,,,"NO ACCESS",,,,,
711,"Матична књига умрлих",1824-1832,Дубовац,Ковин,,,"Историјски архив Панчево",,,,Војводина,"Црквене матичне књиге","Микрофилм, Дигитализовано",,https://www.poreklo.rs/2020/04/10/istorijski-arhiv-pancevo/,,,,,,"NO ACCESS",,,,,
622,"Матична књига венчаних",1824-1852,Идвор,Ковачица,,,"Историјски архив Панчево",,,,Војводина,"Црквене матичне књиге","Микрофилм, Дигитализовано",,https://www.poreklo.rs/2020/04/10/istorijski-arhiv-pancevo/,,,,,,"NO ACCESS",,,,,
731,,1824-1935,Маргита,Пландиште,,,"Историјски архив Бела Црква",,,,Војводина,Остало,Дигитализовано,,https://www.poreklo.rs/2020/04/10/istorijski-arhiv-bela-crkva/,,,,,,"NO ACCESS",,,,,
673,"Матична књига рођених",1825-1828,Баваниште,Ковин,,,"Историјски архив Панчево",,,,Војводина,"Црквене матичне књиге","Микрофилм, Дигитализовано",,https://www.poreklo.rs/2020/04/10/istorijski-arhiv-pancevo/,,,,,,"NO ACCESS",,,,,
674,"Матична књига рођених",1825-1828,Баваниште,Ковин,,,"Историјски архив Панчево",,,,Војводина,"Црквене матичне књиге","Микрофилм, Дигитализовано",,https://www.poreklo.rs/2020/04/10/istorijski-arhiv-pancevo/,,,,,,"NO ACCESS",,,,,
547,"Матична књига умрлих",1825-1833,Омољица,Панчево,,,"Историјски архив Панчево",,,,Војводина,"Црквене матичне књиге","Микрофилм, Дигитализовано",,https://www.poreklo.rs/2020/04/10/istorijski-arhiv-pancevo/,,,,,,"NO ACCESS",,,,,
1576,,1825-1835,Мол,Ада,,,"Историјски архив Сента",,,,Војводина,Остало,,,https://www.poreklo.rs/2020/04/10/istorijski-arhiv-senta/,,,,,,"NO ACCESS",,,,,