book_id,title,author_or_editor,isbn,publisher,source,num_red,place,copyright_year,categories,audience,area,kind_of,media,thumbnail_url,info_url,reference_url,reference_no,notes,note_ii,status,borrower_id,due_date,date_created,date_modified,created_by,modified_by
13940,Бановац,1888-1912,Петриња,,,,"Национална и свеучилишна књижница Загреб",,,General,"Лика, Банија и Кордун","Штампана издања","2 3",,,http://dnc.nsk.hr/newspapers/LibraryTitle.aspx?id=c833007d-7331-4d7e-b188-e1b374b6d34f,,"Лист за поуку, трговину, обрт и господарство, излазио је у Петрињи. Покренуо га је Стјепан Пејаковић, тадашњи начелник града Петриње. Лист је подупирао опозициону Независну народну странку. Године 1913. мења наслов у Нови Бановац. Штампан на латиници.","Претраживо у тексту",,"NO ACCESS",,,,arhivar1,Uzi
13941,Бановац,1914-1919,Петриња,,,,"Национална и свеучилишна књижница Загреб",,,General,"Лика, Банија и Кордун","Штампана издања","2 3",,,http://dnc.nsk.hr/newspapers/LibraryTitle.aspx?id=b9d621d0-9e71-4eb1-b16a-409f14b1595a,,"Лист за јавне прилике, поуку, народну привреду и забаву. На латиници.","Претраживо у тексту",,"NO ACCESS",,,,arhivar1,Uzi
13944,Браник,1871,Сисак,,,,"Национална и свеучилишна књижница Загреб",,,General,"Лика, Банија и Кордун","Штампана издања","2 3",,,http://dnc.nsk.hr/newspapers/LibraryTitle.aspx?id=151b5cff-1e87-49c5-91fb-915ddf823c50,,,"Претраживо у тексту",,"NO ACCESS",,,,arhivar1,Uzi
5504,"Домовни протокол",1846-1930,Уштица,Јасеновац,,S1846-1930,Непознато,,"Матице Српске православне цркве",,"Лика, Банија и Кордун","Домовни протоколи",,,,,HRA-02231-1,,,,"NO ACCESS",,,,arhivar1,Uzi
5822,"Домовни протокол",1933-1952,Уштица,Јасеновац,,S1933-1952,Непознато,,"Матице Српске православне цркве",,"Лика, Банија и Кордун","Домовни протоколи",,,,,HRA-02486-1,,,,"NO ACCESS",,,,arhivar1,Uzi
14034,Заточник,1869-1871,Сисак,,,,"Национална и свеучилишна књижница Загреб",,,General,"Лика, Банија и Кордун","Штампана издања","2 3",,,http://dnc.nsk.hr/newspapers/LibraryTitle.aspx?id=63ae38af-d74c-4d01-9d01-3638ba62841b&y=1870&m=7&d=13,,,"Претраживо у тексту",,"NO ACCESS",,,,arhivar1,Uzi
12285,Индекс,1886-1899,Блиња,Петриња,,I1886-1899,"Државни архив у Сиску",,"Матице Српске православне цркве",,"Лика, Банија и Кордун",Индекси,,,,,HRA-08725-1,"Казало вјенчаних.",,,"NO ACCESS",,,,arhivar1,Uzi
12330,Индекс,1886-1899,Јошавица,Петриња,,I1886-1899,"Државни архив у Сиску",,"Матице Српске православне цркве",,"Лика, Банија и Кордун",Индекси,,,,,HRA-08770-1,"Казало рођених.",,,"NO ACCESS",,,,arhivar1,Uzi
12333,Индекс,1886-1896,Јошавица,Петриња,,I1886-1896,"Државни архив у Сиску",,"Матице Српске православне цркве",,"Лика, Банија и Кордун",Индекси,,,,,HRA-08773-1,"Казало умрлих.",,,"NO ACCESS",,,,arhivar1,Uzi
12402,Индекс,1886-1899,"Велики Шушњар",Петриња,,I1886-1899,"Државни архив у Сиску",,"Матице Српске православне цркве",,"Лика, Банија и Кордун",Индекси,,,,,HRA-08842-1,"Казало рођених.",,,"NO ACCESS",,,,arhivar1,Uzi
12404,Индекс,1886-1899,"Велики Шушњар",Петриња,,I1886-1899,"Државни архив у Сиску",,"Матице Српске православне цркве",,"Лика, Банија и Кордун",Индекси,,,,,HRA-08844-1,"Казало вјенчаних.",,,"NO ACCESS",,,,arhivar1,Uzi
12406,Индекс,1886-1899,"Велики Шушњар",Петриња,,I1886-1899,"Државни архив у Сиску",,"Матице Српске православне цркве",,"Лика, Банија и Кордун",Индекси,,,,,HRA-08846-1,"Казало умрлих.",,,"NO ACCESS",,,,arhivar1,Uzi
13989,"Лички глас",1925-1926,Госпић,,,,"Национална и свеучилишна књижница Загреб",,,General,"Лика, Банија и Кордун","Штампана издања","2 3",,,http://dnc.nsk.hr/newspapers/LibraryTitle.aspx?id=0443db29-268b-4cf3-8563-bfeb4cfdb527&y=1926&m=1&d=31,,"Независни хрватски лист за политику, просвету и господарство","Претраживо у тексту",,"NO ACCESS",,,,arhivar1,Uzi
13990,"Лички Хрват",1922-1924,Госпић,,,,"Национална и свеучилишна књижница Загреб",,,General,"Лика, Банија и Кордун","Штампана издања","2 3",,,http://dnc.nsk.hr/newspapers/LibraryTitle.aspx?id=c3326e09-fdb8-4b63-8dee-47a7ad0379a6&y=1924&m=1&d=3,,"Сељачко гласило за политику, просвету и господарство","Претраживо у тексту",,"NO ACCESS",,,,arhivar1,Uzi
2913,"Матична књига венчаних",1860-1918,Утолица,"Хрватска Костајница",,V1860-1918,"Матични уред Хрватска Костајница",,"Матице Српске православне цркве",,"Лика, Банија и Кордун","Црквене матичне књиге",,,,,HRA-00005-1,,,,"NO ACCESS",,,,arhivar1,Uzi
2914,"Матична књига венчаних",1918-1930,Утолица,"Хрватска Костајница",,V1918-1930,"Матични уред Хрватска Костајница",,"Матице Српске православне цркве",,"Лика, Банија и Кордун","Црквене матичне књиге",,,,,HRA-00006-1,,,,"NO ACCESS",,,,arhivar1,Uzi
2915,"Матична књига венчаних",1931-1935,Утолица,"Хрватска Костајница",,V1931-1935,"Матични уред Хрватска Костајница",,"Матице Српске православне цркве",,"Лика, Банија и Кордун","Црквене матичне књиге",,,,,HRA-00007-1,,,,"NO ACCESS",,,,arhivar1,Uzi
2916,"Матична књига венчаних",1936-1941,Утолица,"Хрватска Костајница",,V1936-1941,"Матични уред Хрватска Костајница",,"Матице Српске православне цркве",,"Лика, Банија и Кордун","Црквене матичне књиге",,,,,HRA-00008-1,,,,"NO ACCESS",,,,arhivar1,Uzi
3047,"Матична књига венчаних",1831,"Бабина Ријека","Доњи Kукурузари",,V1831-0,"Хрватски државни архив",,"Матице Српске православне цркве",,"Лика, Банија и Кордун","Црквене матичне књиге",,FS1,https://www.poreklo.rs/2020/04/05/hrvatski-drzavni-arhiv/,,HRA-00135-3,,,,"NO ACCESS",,,,arhivar1,Uzi
3048,"Матична књига венчаних",1833,"Бабина Ријека","Доњи Kукурузари",,V1833-0,"Хрватски државни архив",,"Матице Српске православне цркве",,"Лика, Банија и Кордун","Црквене матичне књиге",,FS1,https://www.poreklo.rs/2020/04/05/hrvatski-drzavni-arhiv/,,HRA-00135-4,,,,"NO ACCESS",,,,arhivar1,Uzi
3049,"Матична књига венчаних",1834,"Бабина Ријека","Доњи Kукурузари",,V1834-0,"Хрватски државни архив",,"Матице Српске православне цркве",,"Лика, Банија и Кордун","Црквене матичне књиге",,FS1,https://www.poreklo.rs/2020/04/05/hrvatski-drzavni-arhiv/,,HRA-00135-5,,,,"NO ACCESS",,,,arhivar1,Uzi
3280,"Матична књига венчаних",1857,Бјелопоље,"Плитвичка Језера",,V1857-0,"Хрватски државни архив",,"Матице Српске православне цркве",,"Лика, Банија и Кордун","Црквене матичне књиге",,FS1,https://www.poreklo.rs/2020/04/05/hrvatski-drzavni-arhiv/,,HRA-00354-3,,,,"NO ACCESS",,,,arhivar1,Uzi
3335,"Матична књига венчаних",1833,Бојна,Глина,,V1833-0,"Хрватски државни архив",,"Матице Српске православне цркве",,"Лика, Банија и Кордун","Црквене матичне књиге",,FS1,https://www.poreklo.rs/2020/04/05/hrvatski-drzavni-arhiv/,,HRA-00392-3,,,,"NO ACCESS",,,,arhivar1,Uzi
3336,"Матична књига венчаних",1857,Бојна,Глина,,V1857-0,"Хрватски државни архив",,"Матице Српске православне цркве",,"Лика, Банија и Кордун","Црквене матичне књиге",,FS1,https://www.poreklo.rs/2020/04/05/hrvatski-drzavni-arhiv/,,HRA-00392-4,,,,"NO ACCESS",,,,arhivar1,Uzi
3383,"Матична књига венчаних",1834,Боројевићи,"Доњи Kукурузари",,V1834-0,"Хрватски државни архив",,"Матице Српске православне цркве",,"Лика, Банија и Кордун","Црквене матичне књиге",,FS1,https://www.poreklo.rs/2020/04/05/hrvatski-drzavni-arhiv/,,HRA-00429-2,,,,"NO ACCESS",,,,arhivar1,Uzi
3494,"Матична књига венчаних",1857,"Брезово Поље",Глина,,V1857-0,"Хрватски државни архив",,"Матице Српске православне цркве",,"Лика, Банија и Кордун","Црквене матичне књиге",,FS1,https://www.poreklo.rs/2020/04/05/hrvatski-drzavni-arhiv/,,HRA-00534-2,,,,"NO ACCESS",,,,arhivar1,Uzi
3547,"Матична књига венчаних",1857,Бунић,Удбина,,V1857-0,"Хрватски државни архив",,"Матице Српске православне цркве",,"Лика, Банија и Кордун","Црквене матичне књиге",,FS1,https://www.poreklo.rs/2020/04/05/hrvatski-drzavni-arhiv/,,HRA-00578-3,,,,"NO ACCESS",,,,arhivar1,Uzi
3548,"Матична књига венчаних",1858,Бунић,Удбина,,V1858-0,"Хрватски државни архив",,"Матице Српске православне цркве",,"Лика, Банија и Кордун","Црквене матичне књиге",,FS1,https://www.poreklo.rs/2020/04/05/hrvatski-drzavni-arhiv/,,HRA-00578-4,,,,"NO ACCESS",,,,arhivar1,Uzi
3570,"Матична књига венчаних",1929-1940,Црнац,Црнац,,V1929-1940,"Државни архив у Осијеку",,"Матице Српске православне цркве",,"Лика, Банија и Кордун","Црквене матичне књиге",,,,,HRA-00591-1,,,,"NO ACCESS",,,,arhivar1,Uzi
3624,"Матична књига венчаних",1886-1899,Четвртковац,Суња,,V1886-1899,Непознато,,"Матице Српске православне цркве",,"Лика, Банија и Кордун","Црквене матичне књиге",,FS1,,,HRA-00636-1,"Овјерен препис",,,"NO ACCESS",,,,arhivar1,Uzi
3627,"Матична књига венчаних","1900-1938 (до 1920. године)",Четвртковац,Суња,,V1900-1938,Непознато,,"Матице Српске православне цркве",,"Лика, Банија и Кордун","Црквене матичне књиге",,FS1,,,HRA-00639-1,"Овјерен препис",,,"NO ACCESS",,,,arhivar1,Uzi
3770,"Матична књига венчаних",1857,"Дебело Брдо",Удбина,,V1857-0,"Хрватски државни архив",,"Матице Српске православне цркве",,"Лика, Банија и Кордун","Црквене матичне књиге",,FS1,https://www.poreklo.rs/2020/04/05/hrvatski-drzavni-arhiv/,,HRA-00768-3,,,,"NO ACCESS",,,,arhivar1,Uzi
3771,"Матична књига венчаних",1858,"Дебело Брдо",Удбина,,V1858-0,"Хрватски државни архив",,"Матице Српске православне цркве",,"Лика, Банија и Кордун","Црквене матичне књиге",,FS1,https://www.poreklo.rs/2020/04/05/hrvatski-drzavni-arhiv/,,HRA-00768-4,,,,"NO ACCESS",,,,arhivar1,Uzi
3780,"Матична књига венчаних",1830,Дивосело,Госпић,,V1830-0,"Хрватски државни архив",,"Матице Српске православне цркве",,"Лика, Банија и Кордун","Црквене матичне књиге",,FS1,https://www.poreklo.rs/2020/04/05/hrvatski-drzavni-arhiv/,,HRA-00772-4,,,,"NO ACCESS",,,,arhivar1,Uzi
3781,"Матична књига венчаних",1856,Дивосело,Госпић,,V1856-0,"Хрватски државни архив",,"Матице Српске православне цркве",,"Лика, Банија и Кордун","Црквене матичне књиге",,FS1,https://www.poreklo.rs/2020/04/05/hrvatski-drzavni-arhiv/,,HRA-00772-5,,,,"NO ACCESS",,,,arhivar1,Uzi
3782,"Матична књига венчаних",1857,Дивосело,Госпић,,V1857-0,"Хрватски државни архив",,"Матице Српске православне цркве",,"Лика, Банија и Кордун","Црквене матичне књиге",,FS1,https://www.poreklo.rs/2020/04/05/hrvatski-drzavni-arhiv/,,HRA-00772-6,,,,"NO ACCESS",,,,arhivar1,Uzi
4046,"Матична књига венчаних",1833,Глина,Глина,,V1833-0,"Хрватски државни архив",,"Матице Српске православне цркве",,"Лика, Банија и Кордун","Црквене матичне књиге",,FS1,https://www.poreklo.rs/2020/04/05/hrvatski-drzavni-arhiv/,,HRA-01018-3,,,,"NO ACCESS",,,,arhivar1,Uzi
4047,"Матична књига венчаних",1857,Глина,Глина,,V1857-0,"Хрватски државни архив",,"Матице Српске православне цркве",,"Лика, Банија и Кордун","Црквене матичне књиге",,FS1,https://www.poreklo.rs/2020/04/05/hrvatski-drzavni-arhiv/,,HRA-01018-4,,,,"NO ACCESS",,,,arhivar1,Uzi
4087,"Матична књига венчаних",1830,Госпић,Госпић,,V1830-0,"Хрватски државни архив",,"Матице Српске православне цркве",,"Лика, Банија и Кордун","Црквене матичне књиге",,FS1,https://www.poreklo.rs/2020/04/05/hrvatski-drzavni-arhiv/,,HRA-01046-4,,,,"NO ACCESS",,,,arhivar1,Uzi
4088,"Матична књига венчаних",1856,Госпић,Госпић,,V1856-0,"Хрватски државни архив",,"Матице Српске православне цркве",,"Лика, Банија и Кордун","Црквене матичне књиге",,FS1,https://www.poreklo.rs/2020/04/05/hrvatski-drzavni-arhiv/,,HRA-01046-5,,,,"NO ACCESS",,,,arhivar1,Uzi
4089,"Матична књига венчаних",1857,Госпић,Госпић,,V1857-0,"Хрватски државни архив",,"Матице Српске православне цркве",,"Лика, Банија и Кордун","Црквене матичне књиге",,FS1,https://www.poreklo.rs/2020/04/05/hrvatski-drzavni-arhiv/,,HRA-01046-6,,,,"NO ACCESS",,,,arhivar1,Uzi
4141,"Матична књига венчаних",1857,Хајтић,Глина,,V1857-0,"Хрватски државни архив",,"Матице Српске православне цркве",,"Лика, Банија и Кордун","Црквене матичне књиге",,FS1,https://www.poreklo.rs/2020/04/05/hrvatski-drzavni-arhiv/,,HRA-01087-2,,,,"NO ACCESS",,,,arhivar1,Uzi
4365,"Матична књига венчаних",1858,Кореница,"Плитвичка Језера",,V1858-0,"Хрватски државни архив",,"Матице Српске православне цркве",,"Лика, Банија и Кордун","Црквене матичне књиге",,FS1,https://www.poreklo.rs/2020/04/05/hrvatski-drzavni-arhiv/,,HRA-01273-2,,,,"NO ACCESS",,,,arhivar1,Uzi
4544,"Матична књига венчаних",1857,Лушчани,Петриња,,V1857-0,"Хрватски државни архив",,"Матице Српске православне цркве",,"Лика, Банија и Кордун","Црквене матичне књиге",,FS1,https://www.poreklo.rs/2020/04/05/hrvatski-drzavni-arhiv/,,HRA-01425-2,,,,"NO ACCESS",,,,arhivar1,Uzi
4568,"Матична књига венчаних",1857,"Мали Градац",Глина,,V1857-0,"Хрватски државни архив",,"Матице Српске православне цркве",,"Лика, Банија и Кордун","Црквене матичне књиге",,FS1,https://www.poreklo.rs/2020/04/05/hrvatski-drzavni-arhiv/,,HRA-01445-2,,,,"NO ACCESS",,,,arhivar1,Uzi
4636,"Матична књига венчаних",1857,Медак,Госпић,,V1857-0,"Хрватски државни архив",,"Матице Српске православне цркве",,"Лика, Банија и Кордун","Црквене матичне књиге",,FS1,https://www.poreklo.rs/2020/04/05/hrvatski-drzavni-arhiv/,,HRA-01499-2,,,,"NO ACCESS",,,,arhivar1,Uzi
4640,"Матична књига венчаних",1830,Медак,Госпић,,V1830-0,"Хрватски државни архив",,"Матице Српске православне цркве",,"Лика, Банија и Кордун","Црквене матичне књиге",,FS1,https://www.poreklo.rs/2020/04/05/hrvatski-drzavni-arhiv/,,HRA-01500-3,,,,"NO ACCESS",,,,arhivar1,Uzi
4641,"Матична књига венчаних",1856,Медак,Госпић,,V1856-0,"Хрватски државни архив",,"Матице Српске православне цркве",,"Лика, Банија и Кордун","Црквене матичне књиге",,FS1,https://www.poreklo.rs/2020/04/05/hrvatski-drzavni-arhiv/,,HRA-01500-4,,,,"NO ACCESS",,,,arhivar1,Uzi
4710,"Матична књига венчаних",1856-1857,Могорић,Госпић,,V1856-1857,"Хрватски државни архив",,"Матице Српске православне цркве",,"Лика, Банија и Кордун","Црквене матичне књиге",,FS1,https://www.poreklo.rs/2020/04/05/hrvatski-drzavni-arhiv/,,HRA-01560-2,,,,"NO ACCESS",,,,arhivar1,Uzi
4758,"Матична књига венчаних",1830-1831,Мутилић,Удбина,,V1830-1831,"Хрватски државни архив",,"Матице Српске православне цркве",,"Лика, Банија и Кордун","Црквене матичне књиге",,FS1,https://www.poreklo.rs/2020/04/05/hrvatski-drzavni-arhiv/,,HRA-01599-2,,,,"NO ACCESS",,,,arhivar1,Uzi
4762,"Матична књига венчаних",1857-1858,Небљуси,"Доњи Лапац",,V1857-1858,"Хрватски државни архив",,"Матице Српске православне цркве",,"Лика, Банија и Кордун","Црквене матичне књиге",,FS1,https://www.poreklo.rs/2020/04/05/hrvatski-drzavni-arhiv/,,HRA-01601-2,,,,"NO ACCESS",,,,arhivar1,Uzi
5126,"Матична књига венчаних",1933,Перна,Топуско,,V1933-0,"Хрватски државни архив",,"Матице Српске православне цркве",,"Лика, Банија и Кордун","Црквене матичне књиге",,FS1,https://www.poreklo.rs/2020/04/05/hrvatski-drzavni-arhiv/,,HRA-01918-2,,,,"NO ACCESS",,,,arhivar1,Uzi
5146,"Матична књига венчаних",1923-1935,Петриња,Петриња,,V1923-1935,Непознато,,"Матице Српске православне цркве",,"Лика, Банија и Кордун","Црквене матичне књиге",,,,,HRA-01936-1,,,,"NO ACCESS",,,,arhivar1,Uzi
5147,"Матична књига венчаних",1936-1946,Петриња,Петриња,,V1936-1946,Непознато,,"Матице Српске православне цркве",,"Лика, Банија и Кордун","Црквене матичне књиге",,,,,HRA-01937-1,,,,"NO ACCESS",,,,arhivar1,Uzi
5153,"Матична књига венчаних",1894-1922,Петриња,Петриња,,V1894-1922,Непознато,,"Матице Српске православне цркве",,"Лика, Банија и Кордун","Црквене матичне књиге",,,,,HRA-01943-1,,,,"NO ACCESS",,,,arhivar1,Uzi
5209,"Матична књига венчаних",1856-1857,Почитељ,Госпић,,V1856-1857,"Хрватски државни архив",,"Матице Српске православне цркве",,"Лика, Банија и Кордун","Црквене матичне књиге",,FS1,https://www.poreklo.rs/2020/04/05/hrvatski-drzavni-arhiv/,,HRA-01988-4,,,,"NO ACCESS",,,,arhivar1,Uzi
5213,"Матична књига венчаних",1857-1858,Подлапача,Удбина,,V1857-1858,"Хрватски државни архив",,"Матице Српске православне цркве",,"Лика, Банија и Кордун","Црквене матичне књиге",,FS1,https://www.poreklo.rs/2020/04/05/hrvatski-drzavni-arhiv/,,HRA-01989-2,,,,"NO ACCESS",,,,arhivar1,Uzi
5310,"Матична књига венчаних",1888-1899,Прокике,Бриње,,V1888-1899,Непознато,,"Матице Српске православне цркве",,"Лика, Банија и Кордун","Црквене матичне књиге",,,,,HRA-02074-1,препис,,,"NO ACCESS",,,,arhivar1,Uzi
5311,"Матична књига венчаних",1888-1899,Прокике,Бриње,,V1888-1899,Непознато,,"Матице Српске православне цркве",,"Лика, Банија и Кордун","Црквене матичне књиге",,,,,HRA-02075-1,препис,,,"NO ACCESS",,,,arhivar1,Uzi
5406,"Матична књига венчаних",1856-1857,Радуч,Ловинац,,V1856-1857,"Хрватски државни архив",,"Матице Српске православне цркве",,"Лика, Банија и Кордун","Црквене матичне књиге",,FS1,https://www.poreklo.rs/2020/04/05/hrvatski-drzavni-arhiv/,,HRA-02148-3,,,,"NO ACCESS",,,,arhivar1,Uzi
5430,"Матична књига венчаних",1833-1834,Раусовац,"Хрватска Костајница",,V1833-1834,"Хрватски државни архив",,"Матице Српске православне цркве",,"Лика, Банија и Кордун","Црквене матичне књиге",,FS1,https://www.poreklo.rs/2020/04/05/hrvatski-drzavni-arhiv/,,HRA-02168-2,,,,"NO ACCESS",,,,arhivar1,Uzi
5471,"Матична књига венчаних",1833-1834,Рујевац,Двор,,V1833-1834,"Хрватски државни архив",,"Матице Српске православне цркве",,"Лика, Банија и Кордун","Црквене матичне књиге",,FS1,https://www.poreklo.rs/2020/04/05/hrvatski-drzavni-arhiv/,,HRA-02207-2,,,,"NO ACCESS",,,,arhivar1,Uzi
5480,"Матична књига венчаних",1831-1842,Сисак,,,V1831-1842,"Хрватски државни архив",,"Војне особе",,"Лика, Банија и Кордун","Црквене матичне књиге",,,https://www.poreklo.rs/2020/04/05/hrvatski-drzavni-arhiv/,,HRA-02213-2,,,,"NO ACCESS",,,,arhivar1,Uzi
5527,"Матична књига венчаних",1856,Смиљан,Госпић,,V1856-0,"Хрватски државни архив",,"Матице Српске православне цркве",,"Лика, Банија и Кордун","Црквене матичне књиге",,FS1,https://www.poreklo.rs/2020/04/05/hrvatski-drzavni-arhiv/,,HRA-02251-2,,,,"NO ACCESS",,,,arhivar1,Uzi
5530,"Матична књига венчаних",1857,Смиљан,Госпић,,V1857-0,"Хрватски државни архив",,"Матице Српске православне цркве",,"Лика, Банија и Кордун","Црквене матичне књиге",,FS1,https://www.poreklo.rs/2020/04/05/hrvatski-drzavni-arhiv/,,HRA-02252-2,,,,"NO ACCESS",,,,arhivar1,Uzi
5625,"Матична књига венчаних",1828-1849,Ступовача,Кутина,,V1828-1849,"Хрватски државни архив",,"Матице Српске православне цркве",,"Лика, Банија и Кордун","Црквене матичне књиге",,,https://www.poreklo.rs/2020/04/05/hrvatski-drzavni-arhiv/,,HRA-02326-2,,,,"NO ACCESS",,,,arhivar1,Uzi
5651,"Матична књига венчаних",1829,Свиница,Мајур,,V1829-0,"Хрватски државни архив",,"Матице Српске православне цркве",,"Лика, Банија и Кордун","Црквене матичне књиге",,FS1,https://www.poreklo.rs/2020/04/05/hrvatski-drzavni-arhiv/,,HRA-02350-1,,,,"NO ACCESS",,,,arhivar1,Uzi
5652,"Матична књига венчаних",1833,Свиница,Мајур,,V1833-0,"Хрватски државни архив",,"Матице Српске православне цркве",,"Лика, Банија и Кордун","Црквене матичне књиге",,FS1,https://www.poreklo.rs/2020/04/05/hrvatski-drzavni-arhiv/,,HRA-02350-2,,,,"NO ACCESS",,,,arhivar1,Uzi
5682,"Матична књига венчаних",1829,Шкаре,Оточац,,V1829-0,"Хрватски државни архив",,"Матице Српске православне цркве",,"Лика, Банија и Кордун","Црквене матичне књиге",,FS1,https://www.poreklo.rs/2020/04/05/hrvatski-drzavni-arhiv/,,HRA-02374-2,,,,"NO ACCESS",,,,arhivar1,Uzi
5940,"Матична књига венчаних",1888-1896,Водотеч,Бриње,,V1888-1896,Непознато,,"Матице Српске православне цркве",,"Лика, Банија и Кордун","Црквене матичне књиге",,FS1,,,HRA-02592-1,препис,,,"NO ACCESS",,,,arhivar1,Uzi
5986,"Матична књига венчаних",1831,Вребац,Госпић,,V1831-0,"Хрватски државни архив",,"Матице Српске православне цркве",,"Лика, Банија и Кордун","Црквене матичне књиге",,FS1,https://www.poreklo.rs/2020/04/05/hrvatski-drzavni-arhiv/,,HRA-02631-3,,,,"NO ACCESS",,,,arhivar1,Uzi
5991,"Матична књига венчаних",1857,Вребац,Госпић,,V1857-0,"Хрватски државни архив",,"Матице Српске православне цркве",,"Лика, Банија и Кордун","Црквене матичне књиге",,FS1,https://www.poreklo.rs/2020/04/05/hrvatski-drzavni-arhiv/,,HRA-02632-2,,,,"NO ACCESS",,,,arhivar1,Uzi
5994,"Матична књига венчаних",1856,Вребац,Госпић,,V1856-0,"Хрватски државни архив",,"Матице Српске православне цркве",,"Лика, Банија и Кордун","Црквене матичне књиге",,FS1,https://www.poreklo.rs/2020/04/05/hrvatski-drzavni-arhiv/,,HRA-02633-2,,,,"NO ACCESS",,,,arhivar1,Uzi
6025,"Матична књига венчаних",1834,Вукошевац,Суња,,V1834-0,"Хрватски државни архив",,"Матице Српске православне цркве",,"Лика, Банија и Кордун","Црквене матичне књиге",,FS1,https://www.poreklo.rs/2020/04/05/hrvatski-drzavni-arhiv/,,HRA-02660-2,,,,"NO ACCESS",,,,arhivar1,Uzi
6902,"Матична књига венчаних",1900-1941,Рудопоље,,,V1900-1941,"Матични уред Грачац",,"Државне матичне књиге",,"Лика, Банија и Кордун","Црквене матичне књиге",,,,,HRA-03509-1,,,,"NO ACCESS",,,,arhivar1,Uzi
6903,"Матична књига венчаних",1939/1973,Рудопоље,,,V1939/1973,"Матични уред Грачац",,"Државне матичне књиге",,"Лика, Банија и Кордун","Црквене матичне књиге",,,,,HRA-03510-1,"Матица обухваћа године: 1939, 1948, 1941, 1960-1962, 1971-1973.",,,"NO ACCESS",,,,arhivar1,Uzi
7678,"Матична књига венчаних",1900-1920,Љесковац,Раковица,,V1900-1920,"Матични уред Слуњ",,"Матице Српске православне цркве",,"Лика, Банија и Кордун","Црквене матичне књиге",,,,,HRA-04264-1,,,,"NO ACCESS",,,,arhivar1,Uzi
7679,"Матична књига венчаних",1921-1939,Љесковац,Раковица,,V1921-1939,"Матични уред Слуњ",,"Матице Српске православне цркве",,"Лика, Банија и Кордун","Црквене матичне књиге",,,,,HRA-04265-1,,,,"NO ACCESS",,,,arhivar1,Uzi
7749,"Матична књига венчаних",1878-1940,Дивосело,Госпић,,V1878-1940,"Државни архив у Госпићу",,"Матице Српске православне цркве",,"Лика, Банија и Кордун","Црквене матичне књиге",,FS0,https://www.poreklo.rs/2013/11/15/drzavni-arhiv-u-gospicu-lika/,,HRA-04335-1,,,,"NO ACCESS",,,,arhivar1,Uzi
7751,"Матична књига венчаних",1878-1940,Дивосело,Госпић,,V1878-1940,"Државни архив у Госпићу",,"Матице Српске православне цркве",,"Лика, Банија и Кордун","Црквене матичне књиге",,FS0,https://www.poreklo.rs/2013/11/15/drzavni-arhiv-u-gospicu-lika/,,HRA-04336-1,,,,"NO ACCESS",,,,arhivar1,Uzi
7754,"Матична књига венчаних",1885-1940,Госпић,Госпић,,V1885-1940,"Државни архив у Госпићу",,"Матице Српске православне цркве",,"Лика, Банија и Кордун","Црквене матичне књиге",,FS0,https://www.poreklo.rs/2013/11/15/drzavni-arhiv-u-gospicu-lika/,,HRA-04338-1,,,,"NO ACCESS",,,,arhivar1,Uzi
7762,"Матична књига венчаних",1878-1940,Медак,Госпић,,V1878-1940,"Државни архив у Госпићу",,"Матице Српске православне цркве",,"Лика, Банија и Кордун","Црквене матичне књиге",,FS0,https://www.poreklo.rs/2013/11/15/drzavni-arhiv-u-gospicu-lika/,,HRA-04343-1,,,,"NO ACCESS",,,,arhivar1,Uzi
7766,"Матична књига венчаних",1878-1940,Могорић,Госпић,,V1878-1940,"Државни архив у Госпићу",,"Матице Српске православне цркве",,"Лика, Банија и Кордун","Црквене матичне књиге",,FS0,https://www.poreklo.rs/2013/11/15/drzavni-arhiv-u-gospicu-lika/,,HRA-04346-1,,,,"NO ACCESS",,,,arhivar1,Uzi
7774,"Матична књига венчаних",1878-1940,Почитељ,Госпић,,V1878-1940,"Државни архив у Госпићу",,"Матице Српске православне цркве",,"Лика, Банија и Кордун","Црквене матичне књиге",,FS0,https://www.poreklo.rs/2013/11/15/drzavni-arhiv-u-gospicu-lika/,,HRA-04352-1,,,,"NO ACCESS",,,,arhivar1,Uzi
7776,"Матична књига венчаних",1878-1940,Почитељ,Госпић,,V1878-1940,"Државни архив у Госпићу",,"Матице Српске православне цркве",,"Лика, Банија и Кордун","Црквене матичне књиге",,FS0,https://www.poreklo.rs/2013/11/15/drzavni-arhiv-u-gospicu-lika/,,HRA-04353-1,,,,"NO ACCESS",,,,arhivar1,Uzi
7779,"Матична књига венчаних",1878-1940,Радуч,Ловинац,,V1878-1940,"Државни архив у Госпићу",,"Матице Српске православне цркве",,"Лика, Банија и Кордун","Црквене матичне књиге",,FS0,https://www.poreklo.rs/2013/11/15/drzavni-arhiv-u-gospicu-lika/,,HRA-04354-2,,,,"NO ACCESS",,,,arhivar1,Uzi
7782,"Матична књига венчаних",1878-1940,Радуч,Ловинац,,V1878-1940,"Државни архив у Госпићу",,"Матице Српске православне цркве",,"Лика, Банија и Кордун","Црквене матичне књиге",,FS0,https://www.poreklo.rs/2013/11/15/drzavni-arhiv-u-gospicu-lika/,,HRA-04355-2,,,,"NO ACCESS",,,,arhivar1,Uzi
7785,"Матична књига венчаних",1891-1940,Смиљан,Госпић,,V1891-1940,"Државни архив у Госпићу",,"Матице Српске православне цркве",,"Лика, Банија и Кордун","Црквене матичне књиге",,FS0,https://www.poreklo.rs/2013/11/15/drzavni-arhiv-u-gospicu-lika/,,HRA-04356-2,,,,"NO ACCESS",,,,arhivar1,Uzi