book_id,title,author_or_editor,isbn,publisher,source,num_red,place,copyright_year,categories,audience,area,kind_of,media,thumbnail_url,info_url,reference_url,reference_no,notes,note_ii,status,borrower_id,due_date,date_created,date_modified,created_by,modified_by
13956,"Danicza horvatzka, slavonzka y dalmatinzka",1835,Загреб,,,,"Национална и свеучилишна књижница Загреб",,,General,"Централна Хрватска","Штампана издања","2 3",,,http://dnc.nsk.hr/newspapers/LibraryTitle.aspx?id=547f90de-4774-42a1-859c-d2b443e1a6cf&y=1835&m=9&d=26,,"Први хрватски културни и књижевни лист, који од 1836. мења назив у Даница илирска.Од 25. јула 1835. новине уводе штокавштину као књижевни језик. На латиници.","Претраживо у тексту",,"NO ACCESS",,,,arhivar1,Uzi
14001,"Novine horvatzke",1835,Загреб,,,,"Национална и свеучилишна књижница Загреб",,,General,"Централна Хрватска","Штампана издања","2 3",,,http://dnc.nsk.hr/newspapers/LibraryTitle.aspx?id=5e41e64d-d273-4447-9d82-98989ed95486&y=1835&m=10&d=3,,"Од 1836. мењају назив у Илирске народне новине, а после забране илирског имена у Народне новине.","Претраживо у тексту",,"NO ACCESS",,,,arhivar1,Uzi
13942,Балкан,1886-1887,Загреб,,,,"Национална и свеучилишна књижница Загреб",,,General,"Централна Хрватска","Штампана издања","2 3",,,http://dnc.nsk.hr/newspapers/LibraryTitle.aspx?id=2f857cee-886d-4d00-9da5-46f3e38ea441,,"Лист за јавне прилике, поуку, народну привреду и забаву. На латиници.","Претраживо у тексту",,"NO ACCESS",,,,arhivar1,Uzi
2861,"Балкански рат",1913,Београд,,,,"Универзитетска библиотека ""Светозар Марковић""",,,General,"Централна Србија","Штампана издања","Дигитализовано, На интернету",,,http://www.unilib.rs/istorijske-novine/pregled?category=PREWWI&newspaper=UB_00034,,"Лист је излазио у Београду једном недељно током 1913. године, од 20. јануара до 25. децембра у свега 40 бројева. Власник и уредник часописа био је Душан Мил. Шијачки. Лист је доносио текстове и слике о балканским ратовима, па се може користити као изузетан историјски извор за проучавање тог периода. Осим текстова који су изузетно информативни и обилују чињеницама и историјским подацима, слике имају веома велику вредност, а међу њима су и пејзажи, прикази градова, као и портрети војника и војсковођа, али и обичних људи.","Претраживо у тексту",,"NO ACCESS",,"Sun Dec  2 00:35:18 2018","Sun May 24 20:58:35 2020",arhivar3,arhivar1
13940,Бановац,1888-1912,Петриња,,,,"Национална и свеучилишна књижница Загреб",,,General,"Лика, Банија и Кордун","Штампана издања","2 3",,,http://dnc.nsk.hr/newspapers/LibraryTitle.aspx?id=c833007d-7331-4d7e-b188-e1b374b6d34f,,"Лист за поуку, трговину, обрт и господарство, излазио је у Петрињи. Покренуо га је Стјепан Пејаковић, тадашњи начелник града Петриње. Лист је подупирао опозициону Независну народну странку. Године 1913. мења наслов у Нови Бановац. Штампан на латиници.","Претраживо у тексту",,"NO ACCESS",,,,arhivar1,Uzi
13941,Бановац,1914-1919,Петриња,,,,"Национална и свеучилишна књижница Загреб",,,General,"Лика, Банија и Кордун","Штампана издања","2 3",,,http://dnc.nsk.hr/newspapers/LibraryTitle.aspx?id=b9d621d0-9e71-4eb1-b16a-409f14b1595a,,"Лист за јавне прилике, поуку, народну привреду и забаву. На латиници.","Претраживо у тексту",,"NO ACCESS",,,,arhivar1,Uzi
2860,"Београдске новине",1915-1918,Београд,,,,"Универзитетска библиотека ""Светозар Марковић""",,,General,Београд,"Штампана издања","Дигитализовано, На интернету",,,http://www.unilib.rs/istorijske-novine/pregled?category=PREWWI&newspaper=NLS_00014,,"Лист је излазио у Београду од 1915. до 1918, у почетку 2 пута недељно, а од бр. 33 у 1916. као дневни лист. Основни циљ листа био је да се успостави контакт немачке окупационе власти са српским народом. Будући да је био окупаторски лист, штампан је латиницом. Одговорни уредник за прва 4 броја био је Вилим Ухер, затим јурај Оршић-Славетићки, а последње 2 године уредник је био хрватски књижевник Милан Огризовић. Новине су редовно доносиле вести о догађајима у свету и земљи. Имале су честе књижевне и научне прилоге наших и страних аутора, са домаћом или страном тематиком. Уз неке бројеве излазили су и специјални прилози, као што је Авала и сл.","Претраживо у тексту",,"NO ACCESS",,"Sun Dec  2 00:32:46 2018","Sun May 24 20:57:18 2020",arhivar3,arhivar1
2862,"Београдске општинске новине","1887-1904, 1928-1929",Београд,,,,"Универзитетска библиотека ""Светозар Марковић""",,,General,Београд,"Штампана издања","Дигитализовано, На интернету",,,http://www.unilib.rs/istorijske-novine/pregled?category=PREWWI&newspaper=UB_00004,,"Лист Београдске општинске новине покренула је Београдска општина 1882. године и у континуитету су излазиле једном недељно до 1913. када је због рата излажење прекинуто. Одговорни уредник био је Драгољуб К. Стојиљковић. У периоду од 1882. до 1913. лист објављује научне расправе и књижевне прилоге. Лист је обновљен 1928. године, богато илустрован фотографијама и од тада искључиво објављује вести о месним проблемима, прати рад општинске управе и органа те управе. Других прилога је било мало, али се истиче преглед историје Београда од Тодора Стефановића Виловског. У периоду од 1932. до 1941. упоредо излазе часопис и недељне новине под истим насловом. И новине и часопис су веома значајна грађа за проучавање јавне управе, градске проблематике, али историје, културне историје и архитектуре Београда.","Претраживо у тексту",,"NO ACCESS",,"Sun Dec  2 00:38:44 2018","Sat May 30 20:08:42 2020",arhivar3,arhivar1
13943,"Бјеловарски тједник",1940,Бјеловар,,,,"Национална и свеучилишна књижница Загреб",,,General,"Славонија, Барања и Западни Срем","Штампана издања","2 3",,,http://dnc.nsk.hr/newspapers/LibraryTitle.aspx?id=6de1b0c9-40bb-4feb-98f8-1bf07a1eb55f,,"Гласило за град Бјеловар и околицу. На латиници.","Претраживо у тексту",,"NO ACCESS",,,,arhivar1,Uzi
2865,"Босанско-херцеговачки Источник",1891-1897,Сарајево,,,,"Универзитетска библиотека ""Светозар Марковић""",,,General,"Средња и источна Босна","Штампана издања","Дигитализовано, На интернету",,,http://www.unilib.rs/istorijske-novine/pregled?category=PREWWI&newspaper=UB_00045,,"Лист је излазио у Сарајеву, једном или два пута месечно од 1887. до 1911, издавала га је Митрополија дабробосанска, а намењен је био за црквено-просветне потребе српско-православног свештенства и народа у Босни и Херцеговини. Лист је покренуо сам Георгије Николаевић, тадашњи архимандрит Дабробосанске митрополије. Овај часопис, поред Босанске виле био је најзначајнији часопис за Србе у Босни и Херцеговини током окупације од стране Аустро-угарске монархије. Током свога излажења 3 пута је мењао свој назив. Прво се звао Дабро-босански Источник, па од 1890. Босанско-херцеговачки Источник, и на крају од 1898. само Источник. Новине садрже бројне важне податке за историју Српске Православне Цркве у Босни и Хецеговини, као и бројне чланке о разним теолошким и друштвеним питањима.","Претраживо у тексту",,"NO ACCESS",,"Sun Dec  2 15:39:54 2018","Fri Jan 29 17:55:56 2021",arhivar3,arhivar1
13944,Браник,1871,Сисак,,,,"Национална и свеучилишна књижница Загреб",,,General,"Лика, Банија и Кордун","Штампана издања","2 3",,,http://dnc.nsk.hr/newspapers/LibraryTitle.aspx?id=151b5cff-1e87-49c5-91fb-915ddf823c50,,,"Претраживо у тексту",,"NO ACCESS",,,,arhivar1,Uzi
13945,Бранислав,1878-1879,Осијек,,,,"Национална и свеучилишна књижница Загреб",,,General,"Славонија, Барања и Западни Срем","Штампана издања","2 3",,,http://dnc.nsk.hr/newspapers/LibraryTitle.aspx?id=6245d81d-4ba2-4fd2-b79f-f1fd58d9e0f7,,,"Претраживо у тексту",,"NO ACCESS",,,,arhivar1,Uzi
13946,Бренцуља,1901,Дубровник,,,,"Национална и свеучилишна књижница Загреб",,,General,Далмација,"Штампана издања","2 3",,,http://dnc.nsk.hr/newspapers/LibraryTitle.aspx?id=00924ffd-4110-4cc2-9e3d-bd45fc912c2a,,"Фољ за пазар. На латиници.","Претраживо у тексту",,"NO ACCESS",,,,arhivar1,Uzi
13947,Бумба,1909,Дубровник,,,,"Национална и свеучилишна књижница Загреб",,,General,Далмација,"Штампана издања","2 3",,,http://dnc.nsk.hr/newspapers/LibraryTitle.aspx?id=0199289d-185d-4a9f-80ec-328d1263e875,,"Издање и штампа Српске Дубровачке Штампарије Др. М. Грацића и др. На латиници.","Претраживо у тексту",,"NO ACCESS",,,,arhivar1,Uzi
2866,"Велика Србија",1916-1918,Солун,,,,"Универзитетска библиотека ""Светозар Марковић""",,,General,"Централна Србија","Штампана издања","Дигитализовано, На интернету",,,http://www.unilib.rs/istorijske-novine/pregled?newspaper=NLS_00010,,"Дневни лист који је излазио у Солуну, од 1916. до 1918. године, и о кому се старао српски конзулат у Солуну. Директор је био Александар Јовановић, а као одговорни уредници потписују се прво М. Тавуларић, затим Бошко Богдановић, па Алекса Грдановић. Лист је доносио вести из земље и света, вести са фронтова, дописивање наших избеглица и њихових породица у домовини, записе о животу наших војника... међу бројним рубрикама, било је и књижевних прилога, а као сарадници листа појављују се Иво Ћипико, Младен Ст. Ђуричић и др. Овај лист наставио је да излази у Скопљу као Стара Србија до 1928.","Претраживо у тексту",,"NO ACCESS",,"Sun Dec  2 15:41:17 2018","Sun Dec  2 15:41:17 2018",arhivar3,arhivar3
2867,"Вечерње новости",1914-1918,Ниш,,,,"Универзитетска библиотека ""Светозар Марковић""",,,General,"Централна Србија","Штампана издања","Дигитализовано, На интернету",,,http://www.unilib.rs/istorijske-novine/pregled?newspaper=NLS_00006,,"Дневни лист који је излазио махом у Београду, од 1893. до 1929.г.; после И светског рата обновљен је већ 1918.г. Од 1914. до 1918. новине су излазиле у Нишу у нешто измењеној опреми и редакцији. Власник и уредник је био Љубомир Бојовић. Временом се променило више уредника; пред рат власник и уредник био је Милан П. Савчић. Неко време заступале су начела Либералне странке, а увек у опозији према Радикалној странци. Поред вести из политике и културног живота, постојали су и књижевни прилози, често из стране књижевности. 1909. мењају наслов у Јутарње новости; 1919. постају Новости; а од 1918. поново враћају стари назив Вечерње новости. Лист је током година мењао и поднаслове, излазио је као Независан политички лист; Независан народни лист; Јутарње издање;) Независан лист; Независан политички и друштвени лист. Комплет листа није сачуван.","Претраживо у тексту",,"NO ACCESS",,"Sun Dec  2 15:42:44 2018","Sun Dec  2 15:42:44 2018",arhivar3,arhivar3
14033,Вировитичан,1899-1929,Вировитица,,,,"Национална и свеучилишна књижница Загреб",,,General,"Славонија, Барања и Западни Срем","Штампана издања","2 3",,,http://dnc.nsk.hr/newspapers/LibraryTitle.aspx?id=ec9f7335-6f85-41ad-a2a7-9af40320fc98&y=1905&m=8&d=27,,"Прве вировитичке недељне новине.","Претраживо у тексту",,"NO ACCESS",,,,arhivar1,Uzi
2868,Војин,1864-1870,Београд,,,,"Универзитетска библиотека ""Светозар Марковић""",,,General,"Централна Србија","Штампана издања","Дигитализовано, На интернету",,,http://www.unilib.rs/istorijske-novine/pregled?category=PREWWI&newspaper=UB_00018,,"Лист је излазио у Београду, од 1864 до 1870. Прве три године излазио је једанпут а касније три пута месечно. Поред стручних војних текстова, доносио је и прилоге из историје ратова. Овај лист био је први у Србији посвећен војним питањима а његово излажење временски се поклапа са стварањем ослободилачких планова кнеза Михајла. Уредник овог листа је Јован Драгашевић, један од најпознатијих и најученијих српских официра свога времена. Он је такође је обогатио српску културу књижевним и научним радовима, унапређивањем војног школства и бригом да створи образован официрски кадар у српској војсци. Сматра се оснивачем српске војне терминологије.","Претраживо у тексту",,"NO ACCESS",,"Sun Dec  2 15:44:43 2018","Sat May 30 20:10:06 2020",arhivar3,arhivar1
2909,"Врбаске новине",1930-1941,"Бања Лука",,,,"Народна библиотека Србије",,,General,"Босанска Крајина","Штампана издања","Дигитализовано, На интернету",,,http://www.digitalna.nb.rs/sf/NBS/novine/Vrbaske_novine,,"Дигиталне копије страница свих бројева дневног листа Врбаске новине. Новине доносе политичке вести и коментаре, вести из културе, прате догађаје, а на странама у наставку је Службени лист Краљевске банске управе Врбаске бановине.","Није претраживо у тексту",,"NO ACCESS",,"Sun Dec  2 18:17:26 2018","Fri Jan 29 17:58:17 2021",arhivar3,arhivar1
2869,Време,1924-1941,Београд,,,,"Универзитетска библиотека ""Светозар Марковић""",,,General,"Централна Србија","Штампана издања","Дигитализовано, На интернету",,,http://www.unilib.rs/istorijske-novine/pregled?newspaper=UB_00043,,"Време је дневни лист који је излазио у Београду од 1921. до 1941. године и доносио дневне вести и новости о животу у Краљевини Југославији и свету између два рата. Био је једна од начитанијих новина тог доба. Уредник ових новина био је Бошко Богдановић. Поред редовних вести из земље и света, лист је пратио и културна дешавања. Имао је сталне рубрике, фељтоне, романе у наставцима, а доносио је и приказе листова, часописа и књига.","Претраживо у тексту",,"NO ACCESS",,"Sun Dec  2 15:46:09 2018","Sun Dec  2 15:46:09 2018",arhivar3,arhivar3
2871,"Глас народа",1871-1875,"Нови Сад",,,,"Универзитетска библиотека ""Светозар Марковић""",,,General,Војводина,"Штампана издања",,,,http://www.unilib.rs/istorijske-novine/pregled?category=PREWWI&newspaper=UB_00028,,"Глас народа излазио је једном недељно у Новом Саду од 1871. до 1876, а после дуге паузе у Старом Бечеју и Бачком Добром Пољу од 1886. до 1887. Лист је доносио чланке и прилоге везане за народне ствари, привреду, промет, занат, трговину, поуку и забаву.Власник и издавач листа била је ""Задруга за српску народну штампарију"", а први уредник Панта Поповић. После њега, лист су уређивали Владан Арсенијевић и Стеван В. Поповић. Није поуздано утврђено до када је лист излазио, а у Југословенској штампи Јована Скерлића стоји да је излазио све до 1893.","Претраживо у тексту",,"NO ACCESS",,"Sun Dec  2 15:48:25 2018","Sat May 30 20:11:06 2020",arhivar3,arhivar1
13961,"Гласник далматински",1849-1866,Задар,,,,"Национална и свеучилишна књижница Загреб",,,General,Далмација,"Штампана издања","2 3",,,http://dnc.nsk.hr/newspapers/LibraryTitle.aspx?id=e3c3a99c-5dfb-49e6-a6eb-28c01dde2c74&y=1849&m=8&d=2,,"Службени лист аустријске управе у Далмацији. На латиници.","Претраживо у тексту",,"NO ACCESS",,,,arhivar1,Uzi
13962,Гласоноша,1905-1909,Карловац,,,,"Национална и свеучилишна књижница Загреб",,,General,Хрватска,"Штампана издања","2 3",,,http://dnc.nsk.hr/newspapers/LibraryTitle.aspx?id=2d226bb9-d313-4cbc-b39a-57d62c534025&y=1909&m=9&d=12,,,"Претраживо у тексту",,"NO ACCESS",,,,arhivar1,Uzi
2870,Гласоноша,1885,Ваљево,,,,"Универзитетска библиотека ""Светозар Марковић""",,,General,"Централна Србија","Штампана издања",,,,http://www.unilib.rs/istorijske-novine/pregled?category=PREWWI&newspaper=UB_00050,,"Лист је излазио два пута недељно у Ваљеву током 1885. године са поднасловом Лист за књижевност, забаву и новости. Као власник потписује се Филијала Задруге штампарских радника у Ваљеву, као главни уредник Љубомир П. Ненадовић, док је одговорни уредник био Јован Ј. Молнар. Поред редовних рубрика из књижевности, забаве и науке, лист је доносио и вести, махом локалног карактера, као и велики број огласа. Изашло је само 59 бројева. Овај лист представља библиотечку реткост.","Претраживо у тексту",,"NO ACCESS",,"Sun Dec  2 15:47:12 2018","Sat May 30 20:10:37 2020",arhivar3,arhivar1
13963,Голуб,1919,Дубровник,,,,"Национална и свеучилишна књижница Загреб",,,General,Далмација,"Штампана издања","2 3",,,http://dnc.nsk.hr/newspapers/LibraryTitle.aspx?id=f7ad2894-61f1-4470-97bd-79ecc056ac99&y=1919&m=4&d=19,,,"Претраживо у тексту",,"NO ACCESS",,,,arhivar1,Uzi
13965,Гризлица,1932,Дубровник,,,,"Национална и свеучилишна књижница Загреб",,,General,Далмација,"Штампана издања","2 3",,,http://dnc.nsk.hr/newspapers/LibraryTitle.aspx?id=e97822fd-5cbf-451f-89ba-c5b584b49a76&y=1932&m=3&d=26,,,"Претраживо у тексту",,"NO ACCESS",,,,arhivar1,Uzi
13964,Гринтавац,1937,Дубровник,,,,"Национална и свеучилишна књижница Загреб",,,General,Далмација,"Штампана издања","2 3",,,http://dnc.nsk.hr/newspapers/LibraryTitle.aspx?id=333baf8d-b4de-42b5-b899-9d7ed6bc6a04&y=1937&m=5&d=5,,,"Претраживо у тексту",,"NO ACCESS",,,,arhivar1,Uzi
2873,"Дабро-босански Источник",1887-1890,Сарајево,,,,"Универзитетска библиотека ""Светозар Марковић""",,,General,"Средња и источна Босна","Штампана издања","Дигитализовано, На интернету",,,http://www.unilib.rs/istorijske-novine/pregled?category=PREWWI&newspaper=UB_00024,,"Лист је излазио у Сарајеву, једном или два пута месечно од 1887. до 1911, издавала га је Митрополија дабробосанска, а намењен је био за црквено-просветне потребе српско-православног свештенства и народа у Босни и Херцеговини. Лист је покренуо сам Георгије Николаевић, тадашњи архимандрит Дабробосанске митрополије. Овај часопис, поред Босанске виле био је најзначајнији часопис за Србе у Босни и Херцеговини током окупације од стране Аустро-угарске монархије. Током свога излажења 3 пута је мењао свој назив. Прво се звао Дабро-босански Источник, па од 1890. Босанско-херцеговачки Источник, и на крају од 1898. само Источник. Новине садрже бројне важне податке за историју Српске Православне Цркве у Босни и Хецеговини, као и бројне чланке о разним теолошким и друштвеним питањима.","Претраживо у тексту",,"NO ACCESS",,"Sun Dec  2 15:50:01 2018","Fri Jan 29 17:56:17 2021",arhivar3,arhivar1
13951,"Даница илирска",1836-1843,Загреб,,,,"Национална и свеучилишна књижница Загреб",,,General,"Централна Хрватска","Штампана издања","2 3",,,http://dnc.nsk.hr/newspapers/LibraryTitle.aspx?id=13814fb3-98f0-4288-a955-ab222228233d,,"Године 1836. лист Danicza horvatzka, slavonzka y dalmatinzka мења наслову у Даница илирска. Новине су писане на штокавском наречју и писане новим правописом, доносиле су забавне, поучне, књижевне прилоге и историјске догађаје. Од 1843. после забране илирског имена, новине излазе под старим насловом - Даница хорватска, славонска и далматинска.",,,"NO ACCESS",,,,arhivar1,Uzi
13955,"Даница илирска",1849-1867,Загреб,,,,"Национална и свеучилишна књижница Загреб",,,General,"Централна Хрватска","Штампана издања","2 3",,,http://dnc.nsk.hr/newspapers/LibraryTitle.aspx?id=1366795e-d3ea-4e8c-9c01-c6c114a15e14&y=1863&m=1&d=10,,"Од 1849. лист се вратио овом називу, под којим је излазио у периоду од 18336. до 1843. У међувремену носио назив Даница хорватска, славонска и далматинска. На латиници.","Претраживо у тексту",,"NO ACCESS",,,,arhivar1,Uzi
13950,"Даница хорватска, славонска и далматинска",1843-1848,Загреб,,,,"Национална и свеучилишна књижница Загреб",,,General,"Централна Хрватска","Штампана издања","2 3",,,http://dnc.nsk.hr/newspapers/LibraryTitle.aspx?id=d2e4bfc8-03b0-455f-bebc-2f6debc26ab2,,"Од јануара 1843, одлуком Државне конференције у Бечу, забрањено је коришћење илирског имена и сваке политичке и културне делатности у духу илиризма, па је Даница илирска променила име у Даница хорватска, славонска и далматинска. На латиници.","Претраживо у тексту",,"NO ACCESS",,,,arhivar1,Uzi
2864,"Добојски лист",1946,Добој,,,,"Универзитетска библиотека ""Светозар Марковић""",,,General,"Североисточна Босна","Штампана издања","Дигитализовано, На интернету",,,http://www.unilib.rs/istorijske-novine/pregled?newspaper=UB_00052,,"Орган окружног одбора Народног фронта - Добој. Први број изашао 25. септембра 1946. Дигитализовано шест бројева (25.9.1946, 5.10.1946, 16.10.1946, 26.10.1946, 9.11.1946. и 23.11.1946)","Претраживо у тексту",,"NO ACCESS",,"Sun Dec  2 01:06:43 2018","Fri Jan 29 17:55:15 2021",arhivar3,arhivar1
13957,Дрнда,1934,Дубровник,,,,"Национална и свеучилишна књижница Загреб",,,General,Далмација,"Штампана издања","2 3",,,http://dnc.nsk.hr/newspapers/LibraryTitle.aspx?id=ced7496b-cba0-4657-97fb-b63e41f2aa7e&y=1934&m=2&d=2,,,"Претраживо у тексту",,"NO ACCESS",,,,arhivar1,Uzi
13958,"Дубровачке кундурице",1937,Загреб,,,,"Национална и свеучилишна књижница Загреб",,,General,"Централна Хрватска","Штампана издања","2 3",,,http://dnc.nsk.hr/newspapers/LibraryTitle.aspx?id=7f33ac51-3d11-4ad3-babe-faa16e74d753&y=1937&m=1&d=9,,,"Претраживо у тексту",,"NO ACCESS",,,,arhivar1,Uzi
14037,"Женски лист",1925-1938,Загреб,,,,"Национална и свеучилишна књижница Загреб",,,General,"Централна Хрватска","Штампана издања","2 3",,,http://dnc.nsk.hr/newspapers/LibraryTitle.aspx?id=c0c31c8e-0793-48cb-97e0-2eb0e36f718e&y=1932&m=5&d=1,,"Лист за моду, забаву и кућанство","Претраживо у тексту",,"NO ACCESS",,,,arhivar1,Uzi
14039,"Живила Хрватска",1898-1899,Загреб,,,,"Национална и свеучилишна књижница Загреб",,,General,"Централна Хрватска","Штампана издања","2 3",,,http://dnc.nsk.hr/newspapers/LibraryTitle.aspx?id=249cf629-9dae-4fd4-bacf-122ebd135c4a&y=1899&m=12&d=14,,"Пучке новине чисте странке права","Претраживо у тексту",,"NO ACCESS",,,,arhivar1,Uzi
14038,"Жидовска смотра",1906-1914,Загреб,,,,"Национална и свеучилишна књижница Загреб",,,General,"Централна Хрватска","Штампана издања","2 3",,,http://dnc.nsk.hr/newspapers/LibraryTitle.aspx?id=e8306e3e-09c6-466f-a0fd-b13280c01f83&y=1914&m=4&d=29,,"Гласило јеврејске заједнице, излазило полумесечно.","Претраживо у тексту",,"NO ACCESS",,,,arhivar1,Uzi
14034,Заточник,1869-1871,Сисак,,,,"Национална и свеучилишна књижница Загреб",,,General,"Лика, Банија и Кордун","Штампана издања","2 3",,,http://dnc.nsk.hr/newspapers/LibraryTitle.aspx?id=63ae38af-d74c-4d01-9d01-3638ba62841b&y=1870&m=7&d=13,,,"Претраживо у тексту",,"NO ACCESS",,,,arhivar1,Uzi
14036,Звижда,1933,Дубровник,,,,"Национална и свеучилишна књижница Загреб",,,General,Далмација,"Штампана издања","2 3",,,http://dnc.nsk.hr/newspapers/LibraryTitle.aspx?id=56abb533-2b15-407a-b9a2-f7f6f558684e&y=1933&m=5&d=13,,,"Претраживо у тексту",,"NO ACCESS",,,,arhivar1,Uzi
2874,"Земунски гласник",1867-1869,Земун,,,,"Универзитетска библиотека ""Светозар Марковић""",,,General,Београд,"Штампана издања","Дигитализовано, На интернету",,,http://www.unilib.rs/istorijske-novine/pregled?category=PREWWI&newspaper=UB_00041,,"Лист је излазио недељно у Земуну од 1867. до 1869. Издавач и уредник био је Игњат К. Сопрон, штампар и публициста немачког порекла. У листу се највише пажње посвећивало вестима локалног карактера, а доносио је и прилоге из књижевности, како домаће тако и преведене. Један од од сарадника био је и Сима Поповић. У листу се може наћи велики број огласа и реклама. Годишња претплата износила је 5 форинти, а за Србију и Босну и Херцеговину 60 гроша.","Претраживо у тексту",,"NO ACCESS",,"Sun Dec  2 17:06:50 2018","Sat May 30 20:13:33 2020",arhivar3,arhivar1
2875,Зора,1896-1901,Мостар,,,,"Универзитетска библиотека ""Светозар Марковић""",,,General,Херцеговина,"Штампана издања","Дигитализовано, На интернету",,,http://www.unilib.rs/istorijske-novine/pregled?category=PREWWI&newspaper=UB_00023,,"Лист је излазио у Мостару, месечно, од 1896. до 1901. Уредници су били угледни писци тога доба Алекса Шантић и Светозар Ћоровић. Од 1898 уместо Ћоровића појављује се Јован Дучић, а од 1900. уз Шантића уредник је и Атанасије Шола. Зора је у Мостару исказивала отвореност у презентирању општих културних и књижевних кретања у Европи тог времена. У својим рубрикама редовно је информисала о кретањима у јужнославенским и европским књижевностима, а осим отворености према сарадницима из Београда и Новог Сада ангажује сараднике и из других средина: Ивана Цанкара, Антуна Густава Матоша, Симу Матавуља и друге. У посебним рубрикама излазили су и кратки прикази нових домаћих и страних листова и књига. Годишња пртеплата износила је 5 форинти.","Претраживо у тексту",,"NO ACCESS",,"Sun Dec  2 17:09:34 2018","Fri Jan 29 17:57:14 2021",arhivar3,arhivar1
14035,"Зора далматинска",1844-1849,Задар,,,,"Национална и свеучилишна књижница Загреб",,,General,Далмација,"Штампана издања","2 3",,,http://dnc.nsk.hr/newspapers/LibraryTitle.aspx?id=1485c980-43bd-4e00-8d9b-3be35378d48b&y=1844&m=5&d=27,,"Књижевно-просветни недељник","Претраживо у тексту",,"NO ACCESS",,,,arhivar1,Uzi