book_id,title,author_or_editor,isbn,publisher,source,num_red,place,copyright_year,categories,audience,area,kind_of,media,thumbnail_url,info_url,reference_url,reference_no,notes,note_ii,status,borrower_id,due_date,date_created,date_modified,created_by,modified_by
13982,Кокот,1920,Дубровник,,,,,,,General,Далмација,"Штампана издања","2 3",,,http://dnc.nsk.hr/newspapers/LibraryTitle.aspx?id=d0c8ad82-4c6a-4fe2-b6a6-878de8d02bb8&y=1920&m=9&d=10,,"Штампано у Српској штампарији","Претраживо у тексту",,"NO ACCESS",,,,arhivar1,Uzi
5598,"Матична књига рођених",1812-1812,Задар,,,R1812-1812,"Државни архив у Задру",,"Државне матичне књиге",,Далмација,"Црквене матичне књиге",,,,,HRA-02308-1,,,,"NO ACCESS",,,,arhivar1,Uzi
5599,"Матична књига венчаних",1812-1812,Задар,,,V1812-1812,"Државни архив у Задру",,"Државне матичне књиге",,Далмација,"Црквене матичне књиге",,,,,HRA-02308-2,,,,"NO ACCESS",,,,arhivar1,Uzi
5600,"Матична књига умрлих",1812-1812,Задар,,,U1812-1812,"Државни архив у Задру",,"Државне матичне књиге",,Далмација,"Црквене матичне књиге",,,,,HRA-02308-3,,,,"NO ACCESS",,,,arhivar1,Uzi
5601,"Матична књига рођених",1813-1814,Задар,,,R1813-1814,"Државни архив у Задру",,"Државне матичне књиге",,Далмација,"Црквене матичне књиге",,,,,HRA-02309-1,,,,"NO ACCESS",,,,arhivar1,Uzi
5602,"Матична књига венчаних",1813-1814,Задар,,,V1813-1814,"Државни архив у Задру",,"Државне матичне књиге",,Далмација,"Црквене матичне књиге",,,,,HRA-02309-2,,,,"NO ACCESS",,,,arhivar1,Uzi
5603,"Матична књига умрлих",1813-1814,Задар,,,U1813-1814,"Државни архив у Задру",,"Државне матичне књиге",,Далмација,"Црквене матичне књиге",,,,,HRA-02309-3,,,,"NO ACCESS",,,,arhivar1,Uzi
5606,"Матична књига венчаних",1813-1815,Задар,,,V1813-1815,"Државни архив у Задру",,"Државне матичне књиге",,Далмација,"Црквене матичне књиге",,,,,HRA-02312-1,,,,"NO ACCESS",,,,arhivar1,Uzi
5607,"Матична књига рођених",1825-1830,Загвозд,,,R1825-1830,"Државни архив у Задру",,"Државне матичне књиге",,Далмација,"Црквене матичне књиге",,,,,HRA-02313-1,,,,"NO ACCESS",,,,arhivar1,Uzi
7070,"Матична књига рођених",1942-1942,Новиград,,,R1942-1942,"Државни архив у Задру",,"Државне матичне књиге",,Далмација,"Црквене матичне књиге",,,,,HRA-03678-1,,,,"NO ACCESS",,,,arhivar1,Uzi
7071,"Матична књига венчаних",1942-1942,Новиград,,,V1942-1942,"Државни архив у Задру",,"Државне матичне књиге",,Далмација,"Црквене матичне књиге",,,,,HRA-03679-1,,,,"NO ACCESS",,,,arhivar1,Uzi
7072,"Матична књига умрлих",1942-1942,Преко,,,U1942-1942,"Државни архив у Задру",,"Државне матичне књиге",,Далмација,"Црквене матичне књиге",,,,,HRA-03680-1,,,,"NO ACCESS",,,,arhivar1,Uzi
7073,"Матична књига умрлих",1942-1942,Смилчић,,,U1942-1942,"Државни архив у Задру",,"Државне матичне књиге",,Далмација,"Црквене матичне књиге",,,,,HRA-03681-1,,,,"NO ACCESS",,,,arhivar1,Uzi
6476,"Матична књига рођених",1894-1909,Лозовац,,,R1894-1909,"Државни архив у Задру и Сплиту",,"Државне матичне књиге",,Далмација,"Црквене матичне књиге",,,,,HRA-03090-1,,,,"NO ACCESS",,,,arhivar1,Uzi
6498,"Матична књига умрлих",1913-1943,Зларин,,,U1913-1943,"Државни архив у Задру и Сплиту",,"Државне матичне књиге",,Далмација,"Црквене матичне књиге",,,,,HRA-03112-1,"Цивилна матична књига.",,,"NO ACCESS",,,,arhivar1,Uzi
6499,"Матична књига умрлих",1944-1949,Зларин,,,U1944-1949,"Државни архив у Задру и Сплиту",,"Државне матичне књиге",,Далмација,"Црквене матичне књиге",,,,,HRA-03113-1,"Цивилна матична књига.",,,"NO ACCESS",,,,arhivar1,Uzi
13983,Клемпесало,1906,Дубровник,,,,"Дубровачке књижнице Дубровник",,,General,Далмација,"Штампана издања","2 3",,,http://dnc.nsk.hr/newspapers/LibraryTitle.aspx?id=32b2babd-e295-47ee-aec7-ce40ce93b26d&y=1906&m=2&d=11,,"Карневалске новине","Претраживо у тексту",,"NO ACCESS",,,,arhivar1,Uzi
14008,Пчела,1920,Дубровник,,,,"Дубровачке књижнице Дубровник",,,General,Далмација,"Штампана издања","2 3",,,http://dnc.nsk.hr/newspapers/LibraryTitle.aspx?id=07d882dc-2b80-400e-bd01-a8f255daa34e&y=1920&m=11&d=18,,"Ванстраначки лист","Претраживо у тексту",,"NO ACCESS",,,,arhivar1,Uzi
14015,Прндеј,1937,Дубровник,,,,"Дубровачке књижнице Дубровник",,,General,Далмација,"Штампана издања","2 3",,,http://dnc.nsk.hr/newspapers/LibraryTitle.aspx?id=e30393d8-7823-4d3b-bc37-6409a9ce9834&y=1937&m=2&d=3,,"Фој за свашта. Карневалске новине.","Претраживо у тексту",,"NO ACCESS",,,,arhivar1,Uzi
7365,"Матична књига умрлих",1830-1842,Вис,,,U1830-1842,"Жупни уред Вис",,"Државне матичне књиге",,Далмација,"Црквене матичне књиге",,,,,HRA-03966-1,"Хварска бискупија, вишки деканат.",,,"NO ACCESS",,,,arhivar1,Uzi
8694,"Матична књига рођених",1947-1949,Марушићи,,,R1947-1949,"Матични уред Бује",,"Државне матичне књиге",,Далмација,"Црквене матичне књиге",,DEL,,,HRA-05209-1,,,,"NO ACCESS",,,,arhivar1,Uzi
8695,"Матична књига рођених",1950-1952,Марушићи,,,R1950-1952,"Матични уред Бује",,"Државне матичне књиге",,Далмација,"Црквене матичне књиге",,DEL,,,HRA-05210-1,,,,"NO ACCESS",,,,arhivar1,Uzi
9183,"Матична књига венчаних",1947-1949,Марушићи,,,V1947-1949,"Матични уред Бује",,"Државне матичне књиге",,Далмација,"Црквене матичне књиге",,DEL,,,HRA-05685-1,,,,"NO ACCESS",,,,arhivar1,Uzi
9184,"Матична књига венчаних",1950-1952,Марушићи,,,V1950-1952,"Матични уред Бује",,"Државне матичне књиге",,Далмација,"Црквене матичне књиге",,DEL,,,HRA-05686-1,,,,"NO ACCESS",,,,arhivar1,Uzi
9185,"Матична књига умрлих",1947-1949,Марушићи,,,U1947-1949,"Матични уред Бује",,"Државне матичне књиге",,Далмација,"Црквене матичне књиге",,DEL,,,HRA-05687-1,,,,"NO ACCESS",,,,arhivar1,Uzi
9186,"Матична књига умрлих",1950-1952,Марушићи,,,U1950-1952,"Матични уред Бује",,"Државне матичне књиге",,Далмација,"Црквене матичне књиге",,DEL,,,HRA-05688-1,,,,"NO ACCESS",,,,arhivar1,Uzi
12275,"Матична књига рођених",1944-1946,Вис,,,R1944-1946,"Матични уред Вис",,"Државне матичне књиге",,Далмација,"Црквене матичне књиге",,,,,HRA-08715-1,,,,"NO ACCESS",,,,arhivar1,Uzi
12276,"Матична књига венчаних",1944-1946,Вис,,,V1944-1946,"Матични уред Вис",,"Државне матичне књиге",,Далмација,"Црквене матичне књиге",,,,,HRA-08716-1,,,,"NO ACCESS",,,,arhivar1,Uzi
12277,"Матична књига умрлих",1944-1946,Вис,,,U1944-1946,"Матични уред Вис",,"Државне матичне књиге",,Далмација,"Црквене матичне књиге",,,,,HRA-08717-1,,,,"NO ACCESS",,,,arhivar1,Uzi
6741,"Матична књига рођених",1920-1928,Мазин,,,R1920-1928,"Матични уред Грачац",,"Државне матичне књиге",,Далмација,"Црквене матичне књиге",,,,,HRA-03349-1,,,,"NO ACCESS",,,,arhivar1,Uzi
6742,"Матична књига рођених",1928-1934,Мазин,,,R1928-1934,"Матични уред Грачац",,"Државне матичне књиге",,Далмација,"Црквене матичне књиге",,,,,HRA-03350-1,,,,"NO ACCESS",,,,arhivar1,Uzi
6763,"Матична књига рођених",1947/1988,Беглуци,,,R1947/1988,"Матични уред Грачац",,"Државне матичне књиге",,Далмација,"Црквене матичне књиге",,,,,HRA-03371-1,"Матица обухваћа раздобља и године: 1947-1950, 1960, 1965 и 1970-1988.",,,"NO ACCESS",,,,arhivar1,Uzi
6765,"Матична књига умрлих",1946-1950,Беглуци,,,U1946-1950,"Матични уред Грачац",,"Државне матичне књиге",,Далмација,"Црквене матичне књиге",,,,,HRA-03373-1,,,,"NO ACCESS",,,,arhivar1,Uzi
6766,"Матична књига рођених",1946-1948,Бротња,,,R1946-1948,"Матични уред Грачац",,"Државне матичне књиге",,Далмација,"Црквене матичне књиге",,,,,HRA-03374-1,,,,"NO ACCESS",,,,arhivar1,Uzi
6767,"Матична књига рођених",1947-1953,Бротња,,,R1947-1953,"Матични уред Грачац",,"Државне матичне књиге",,Далмација,"Црквене матичне књиге",,,,,HRA-03375-1,,,,"NO ACCESS",,,,arhivar1,Uzi
6768,"Матична књига венчаних",1947-1950,Бротња,,,V1947-1950,"Матични уред Грачац",,"Државне матичне књиге",,Далмација,"Црквене матичне књиге",,,,,HRA-03376-1,,,,"NO ACCESS",,,,arhivar1,Uzi
6769,"Матична књига рођених",1900-1907,Брувно,,,R1900-1907,"Матични уред Грачац",,"Државне матичне књиге",,Далмација,"Црквене матичне књиге",,,,,HRA-03377-1,,,,"NO ACCESS",,,,arhivar1,Uzi
6770,"Матична књига рођених",1907-1919,Брувно,,,R1907-1919,"Матични уред Грачац",,"Државне матичне књиге",,Далмација,"Црквене матичне књиге",,,,,HRA-03378-1,,,,"NO ACCESS",,,,arhivar1,Uzi
6771,"Матична књига рођених",1907-1919,Брувно,,,R1907-1919,"Матични уред Грачац",,"Државне матичне књиге",,Далмација,"Црквене матичне књиге",,,,,HRA-03379-1,,,,"NO ACCESS",,,,arhivar1,Uzi
6772,"Матична књига рођених",1919-1926,Брувно,,,R1919-1926,"Матични уред Грачац",,"Државне матичне књиге",,Далмација,"Црквене матичне књиге",,,,,HRA-03380-1,,,,"NO ACCESS",,,,arhivar1,Uzi
6773,"Матична књига рођених",1926-1934,Брувно,,,R1926-1934,"Матични уред Грачац",,"Државне матичне књиге",,Далмација,"Црквене матичне књиге",,,,,HRA-03381-1,,,,"NO ACCESS",,,,arhivar1,Uzi
6774,"Матична књига рођених",1934-1940,Брувно,,,R1934-1940,"Матични уред Грачац",,"Државне матичне књиге",,Далмација,"Црквене матичне књиге",,,,,HRA-03382-1,,,,"NO ACCESS",,,,arhivar1,Uzi
6775,"Матична књига рођених",1934-1940,Брувно,,,R1934-1940,"Матични уред Грачац",,"Државне матичне књиге",,Далмација,"Црквене матичне књиге",,,,,HRA-03383-1,,,,"NO ACCESS",,,,arhivar1,Uzi
6776,"Матична књига рођених",1946-1949,Брувно,,,R1946-1949,"Матични уред Грачац",,"Државне матичне књиге",,Далмација,"Црквене матичне књиге",,,,,HRA-03384-1,"Има и уписа за 1987. годину!",,,"NO ACCESS",,,,arhivar1,Uzi
6777,"Матична књига рођених",1948-1951,Брувно,,,R1948-1951,"Матични уред Грачац",,"Државне матичне књиге",,Далмација,"Црквене матичне књиге",,,,,HRA-03385-1,,,,"NO ACCESS",,,,arhivar1,Uzi
6778,"Матична књига рођених",1948-1952,Брувно,,,R1948-1952,"Матични уред Грачац",,"Државне матичне књиге",,Далмација,"Црквене матичне књиге",,,,,HRA-03386-1,,,,"NO ACCESS",,,,arhivar1,Uzi
6779,"Матична књига венчаних",1900-1919,Брувно,,,V1900-1919,"Матични уред Грачац",,"Државне матичне књиге",,Далмација,"Црквене матичне књиге",,,,,HRA-03387-1,,,,"NO ACCESS",,,,arhivar1,Uzi
6780,"Матична књига венчаних",1915/1937,Брувно,,,V1915/1937,"Матични уред Грачац",,"Државне матичне књиге",,Далмација,"Црквене матичне књиге",,,,,HRA-03388-1,"Матица обухваћа раздобља и године: 1915, 1920-1937.",,,"NO ACCESS",,,,arhivar1,Uzi
6781,"Матична књига венчаних",1914/1950,Брувно,,,V1914/1950,"Матични уред Грачац",,"Државне матичне књиге",,Далмација,"Црквене матичне књиге",,,,,HRA-03389-1,"Матица обухваћа ове године и раздобља: 1914, 1920, 1938-1940, 1946, 1947, 1949 и 1950.",,,"NO ACCESS",,,,arhivar1,Uzi
6782,"Матична књига венчаних",1904/1952,Брувно,,,V1904/1952,"Матични уред Грачац",,"Државне матичне књиге",,Далмација,"Црквене матичне књиге",,,,,HRA-03390-1,"Матица обухваћа раздобља и године: 1904, 1907, 1911, 1919, 1922, 1923, 1926, 1931, 1933, 1937-1939, 1948-1952.",,,"NO ACCESS",,,,arhivar1,Uzi
6784,"Матична књига умрлих",1900-1915,Брувно,,,U1900-1915,"Матични уред Грачац",,"Државне матичне књиге",,Далмација,"Црквене матичне књиге",,,,,HRA-03392-1,,,,"NO ACCESS",,,,arhivar1,Uzi
6785,"Матична књига умрлих",1916-1935,Брувно,,,U1916-1935,"Матични уред Грачац",,"Државне матичне књиге",,Далмација,"Црквене матичне књиге",,,,,HRA-03393-1,,,,"NO ACCESS",,,,arhivar1,Uzi
6786,"Матична књига умрлих",1948-1951,Брувно,,,U1948-1951,"Матични уред Грачац",,"Државне матичне књиге",,Далмација,"Црквене матичне књиге",,,,,HRA-03394-1,,,,"NO ACCESS",,,,arhivar1,Uzi
6787,"Матична књига рођених",1946-1949,Дабашница,,,R1946-1949,"Матични уред Грачац",,"Државне матичне књиге",,Далмација,"Црквене матичне књиге",,,,,HRA-03395-1,,,,"NO ACCESS",,,,arhivar1,Uzi
6788,"Матична књига умрлих",1948-1948,Дабашница,,,U1948-1948,"Матични уред Грачац",,"Државне матичне књиге",,Далмација,"Црквене матичне књиге",,,,,HRA-03396-1,,,,"NO ACCESS",,,,arhivar1,Uzi
6790,"Матична књига рођених",1947-1952,Дерингај,,,R1947-1952,"Матични уред Грачац",,"Државне матичне књиге",,Далмација,"Црквене матичне књиге",,,,,HRA-03398-1,,,,"NO ACCESS",,,,arhivar1,Uzi
6791,"Матична књига рођених",1948-1952,Дерингај,,,R1948-1952,"Матични уред Грачац",,"Државне матичне књиге",,Далмација,"Црквене матичне књиге",,,,,HRA-03399-1,,,,"NO ACCESS",,,,arhivar1,Uzi
6792,"Матична књига рођених",1941-1952,Дерингај,,,R1941-1952,"Матични уред Грачац",,"Државне матичне књиге",,Далмација,"Црквене матичне књиге",,,,,HRA-03400-1,,,,"NO ACCESS",,,,arhivar1,Uzi
6793,"Матична књига венчаних",1941-1952,Дерингај,,,V1941-1952,"Матични уред Грачац",,"Државне матичне књиге",,Далмација,"Црквене матичне књиге",,,,,HRA-03401-1,,,,"NO ACCESS",,,,arhivar1,Uzi
6794,"Матична књига венчаних",1948-1952,Дерингај,,,V1948-1952,"Матични уред Грачац",,"Државне матичне књиге",,Далмација,"Црквене матичне књиге",,,,,HRA-03402-1,,,,"NO ACCESS",,,,arhivar1,Uzi
6795,"Матична књига умрлих",1947-1948,Дерингај,,,U1947-1948,"Матични уред Грачац",,"Државне матичне књиге",,Далмација,"Црквене матичне књиге",,,,,HRA-03403-1,,,,"NO ACCESS",,,,arhivar1,Uzi
6796,"Матична књига умрлих",1948-1952,Дерингај,,,U1948-1952,"Матични уред Грачац",,"Државне матичне књиге",,Далмација,"Црквене матичне књиге",,,,,HRA-03404-1,"Скенови се налазе и на ДВД-у 142.",,,"NO ACCESS",,,,arhivar1,Uzi
6799,"Матична књига рођених",1848-1952,Глогово,,,R1848-1952,"Матични уред Грачац",,"Државне матичне књиге",,Далмација,"Црквене матичне књиге",,,,,HRA-03407-1,"Скенови се налазе и на ДВД-у 142.",,,"NO ACCESS",,,,arhivar1,Uzi
6845,"Матична књига рођених",1900-1908,Мазин,,,R1900-1908,"Матични уред Грачац",,"Државне матичне књиге",,Далмација,"Црквене матичне књиге",,,,,HRA-03452-1,,,,"NO ACCESS",,,,arhivar1,Uzi
6846,"Матична књига рођених",1908-1920,Мазин,,,R1908-1920,"Матични уред Грачац",,"Државне матичне књиге",,Далмација,"Црквене матичне књиге",,,,,HRA-03453-1,,,,"NO ACCESS",,,,arhivar1,Uzi
6847,"Матична књига рођених",1908-1920,Мазин,,,R1908-1920,"Матични уред Грачац",,"Државне матичне књиге",,Далмација,"Црквене матичне књиге",,,,,HRA-03454-1,,,,"NO ACCESS",,,,arhivar1,Uzi
6848,"Матична књига рођених",1936-1940,Мазин,,,R1936-1940,"Матични уред Грачац",,"Државне матичне књиге",,Далмација,"Црквене матичне књиге",,,,,HRA-03455-1,,,,"NO ACCESS",,,,arhivar1,Uzi
6849,"Матична књига венчаних",1920-1940,Мазин,,,V1920-1940,"Матични уред Грачац",,"Државне матичне књиге",,Далмација,"Црквене матичне књиге",,,,,HRA-03456-1,,,,"NO ACCESS",,,,arhivar1,Uzi
6850,"Матична књига венчаних",1920-1940,Мазин,,,V1920-1940,"Матични уред Грачац",,"Државне матичне књиге",,Далмација,"Црквене матичне књиге",,,,,HRA-03457-1,,,,"NO ACCESS",,,,arhivar1,Uzi
6851,"Матична књига венчаних",1900/1964,Мазин,,,V1900/1964,"Матични уред Грачац",,"Државне матичне књиге",,Далмација,"Црквене матичне књиге",,,,,HRA-03458-1,"Матица обухваћа раздобља и године: 1900, 1903, 1922, 1923, 1925-1927, 1931, 1934, 1936, 1937, 1939, 1948-1964.",,,"NO ACCESS",,,,arhivar1,Uzi
6852,"Матична књига венчаних",1922/1978,Мазин,,,V1922/1978,"Матични уред Грачац",,"Државне матичне књиге",,Далмација,"Црквене матичне књиге",,,,,HRA-03459-1,"Матица обухваћа раздобља и године: 1922, 1924, 1937, 1939, 1946, 1948, 1950-1978.",,,"NO ACCESS",,,,arhivar1,Uzi
6853,"Матична књига умрлих",1900-1916,Мазин,,,U1900-1916,"Матични уред Грачац",,"Државне матичне књиге",,Далмација,"Црквене матичне књиге",,,,,HRA-03460-1,,,,"NO ACCESS",,,,arhivar1,Uzi
6854,"Матична књига умрлих",1916-1934,Мазин,,,U1916-1934,"Матични уред Грачац",,"Државне матичне књиге",,Далмација,"Црквене матичне књиге",,,,,HRA-03461-1,,,,"NO ACCESS",,,,arhivar1,Uzi
6855,"Матична књига умрлих",1916-1934,Мазин,,,U1916-1934,"Матични уред Грачац",,"Државне матичне књиге",,Далмација,"Црквене матичне књиге",,,,,HRA-03462-1,,,,"NO ACCESS",,,,arhivar1,Uzi
6856,"Матична књига умрлих",1917/1948,Мазин,,,U1917/1948,"Матични уред Грачац",,"Државне матичне књиге",,Далмација,"Црквене матичне књиге",,,,,HRA-03463-1,"Матица обухваћа године: 1917, 1918, 1934-1938, 1948.",,,"NO ACCESS",,,,arhivar1,Uzi
6857,"Матична књига умрлих",1905/1964,Мазин,,,U1905/1964,"Матични уред Грачац",,"Државне матичне књиге",,Далмација,"Црквене матичне књиге",,,,,HRA-03464-1,,,,"NO ACCESS",,,,arhivar1,Uzi
6858,"Матична књига умрлих",1922/1987,Мазин,,,U1922/1987,"Матични уред Грачац",,"Државне матичне књиге",,Далмација,"Црквене матичне књиге",,,,,HRA-03465-1,"Матица обухваћа године: 1922, 1938-1945, 1948, 1952-1969, 1972-1978, 1986, 1987.",,,"NO ACCESS",,,,arhivar1,Uzi
6859,"Матична књига рођених",1868/1950,Нетека,,,R1868/1950,"Матични уред Грачац",,"Државне матичне књиге",,Далмација,"Црквене матичне књиге",,,,,HRA-03466-1,"Матица обухваћа године: 1868, 1871, 1881, 1886, 1894, 1896, 1909, 1910, 1921, 1923, 1926, 1927, 1930-1936, 1938-1950.",,,"NO ACCESS",,,,arhivar1,Uzi
6860,"Матична књига умрлих",1918/1949,Нетека,,,U1918/1949,"Матични уред Грачац",,"Државне матичне књиге",,Далмација,"Црквене матичне књиге",,,,,HRA-03467-1,"Матица обухваћа године: 1918, 1941, 1943, 1945, 1946, 1948, 1949.",,,"NO ACCESS",,,,arhivar1,Uzi
6861,"Матична књига рођених",1849/1938,Омсица,,,R1849/1938,"Матични уред Грачац",,"Државне матичне књиге",,Далмација,"Црквене матичне књиге",,,,,HRA-03468-1,"Матица обухваћа године:1849, 1864, 1875, 1879, 1882, 1886, 1889, 1900, 1914, 1916, 1918-1933, 1938.",,,"NO ACCESS",,,,arhivar1,Uzi
6862,"Матична књига рођених",1879-1952,Омсица,,,R1879-1952,"Матични уред Грачац",,"Државне матичне књиге",,Далмација,"Црквене матичне књиге",,,,,HRA-03469-1,,,,"NO ACCESS",,,,arhivar1,Uzi
6863,"Матична књига умрлих",1915/1961,Омсица,,,U1915/1961,"Матични уред Грачац",,"Државне матичне књиге",,Далмација,"Црквене матичне књиге",,,,,HRA-03470-1,"Матица обухваћа године: 1915, 1918, 1934, 1937, 1941-1947, 1961.",,,"NO ACCESS",,,,arhivar1,Uzi
6864,"Матична књига умрлих",1921/1952,Омсица,,,U1921/1952,"Матични уред Грачац",,"Државне матичне књиге",,Далмација,"Црквене матичне књиге",,,,,HRA-03471-1,"Матица обухваћа године: 1921, 1938, 1942-1944, 1948-1952.",,,"NO ACCESS",,,,arhivar1,Uzi
6865,"Матична књига рођених",1864-1949,Осредци,,,R1864-1949,"Матични уред Грачац",,"Државне матичне књиге",,Далмација,"Црквене матичне књиге",,,,,HRA-03472-1,,,,"NO ACCESS",,,,arhivar1,Uzi
6866,"Матична књига рођених",1864-1949,Осредци,,,R1864-1949,"Матични уред Грачац",,"Државне матичне књиге",,Далмација,"Црквене матичне књиге",,,,,HRA-03473-1,,,,"NO ACCESS",,,,arhivar1,Uzi
6867,"Матична књига венчаних",1898/1950,Осредци,,,V1898/1950,"Матични уред Грачац",,"Државне матичне књиге",,Далмација,"Црквене матичне књиге",,,,,HRA-03474-1,"Матица обухваћа године: 1898, 1907, 1915, 1924, 1945-1950.",,,"NO ACCESS",,,,arhivar1,Uzi
6868,"Матична књига венчаних",1900/1929,Осредци,,,V1900/1929,"Матични уред Грачац",,"Државне матичне књиге",,Далмација,"Црквене матичне књиге",,,,,HRA-03475-1,"Матица обухваћа године: 1900-1922 и 1924-1929.",,,"NO ACCESS",,,,arhivar1,Uzi
6869,"Матична књига венчаних",1929/1961,Осредци,,,V1929/1961,"Матични уред Грачац",,"Државне матичне књиге",,Далмација,"Црквене матичне књиге",,,,,HRA-03476-1,"Матица обухваћа годие: 1929-1938, 1953-1958, 1961.",,,"NO ACCESS",,,,arhivar1,Uzi
6870,"Матична књига умрлих",1930/1950,Осредци,,,U1930/1950,"Матични уред Грачац",,"Државне матичне књиге",,Далмација,"Црквене матичне књиге",,,,,HRA-03477-1,"Матица обухваћа године: 1930, 1943-1950.",,,"NO ACCESS",,,,arhivar1,Uzi
6871,"Матична књига рођених",1876-1947,Отрић,,,R1876-1947,"Матични уред Грачац",,"Државне матичне књиге",,Далмација,"Црквене матичне књиге",,,,,HRA-03478-1,,,,"NO ACCESS",,,,arhivar1,Uzi
6872,"Матична књига рођених",1878-1952,Отрић,,,R1878-1952,"Матични уред Грачац",,"Државне матичне књиге",,Далмација,"Црквене матичне књиге",,,,,HRA-03479-1,,,,"NO ACCESS",,,,arhivar1,Uzi
6873,"Матична књига рођених",1878-1952,Отрић,,,R1878-1952,"Матични уред Грачац",,"Државне матичне књиге",,Далмација,"Црквене матичне књиге",,,,,HRA-03480-1,,,,"NO ACCESS",,,,arhivar1,Uzi
6874,"Матична књига венчаних",1914/1952,Отрић,,,V1914/1952,"Матични уред Грачац",,"Државне матичне књиге",,Далмација,"Црквене матичне књиге",,,,,HRA-03481-1,"Матица обухваћа године: 1914, 1920, 1934, 1948-1952.",,,"NO ACCESS",,,,arhivar1,Uzi
6875,"Матична књига венчаних",1918/1947,Отрић,,,V1918/1947,"Матични уред Грачац",,"Државне матичне књиге",,Далмација,"Црквене матичне књиге",,,,,HRA-03482-1,"Матица обухваћа године: 1918, 1924, 1946, 1947.",,,"NO ACCESS",,,,arhivar1,Uzi
6876,"Матична књига умрлих",1946-1947,Отрић,,,U1946-1947,"Матични уред Грачац",,"Државне матичне књиге",,Далмација,"Црквене матичне књиге",,,,,HRA-03483-1,,,,"NO ACCESS",,,,arhivar1,Uzi
6877,"Матична књига умрлих",1948-1952,Отрић,,,U1948-1952,"Матични уред Грачац",,"Државне матичне књиге",,Далмација,"Црквене матичне књиге",,,,,HRA-03484-1,,,,"NO ACCESS",,,,arhivar1,Uzi
6878,"Матична књига венчаних",1897/1948,Прибудић,,,V1897/1948,"Матични уред Грачац",,"Државне матичне књиге",,Далмација,"Црквене матичне књиге",,,,,HRA-03485-1,"Матица обухваћа године:1897, 1903, 1904, 1920, 1922, 1940, 1946-1948.",,,"NO ACCESS",,,,arhivar1,Uzi
6879,"Матична књига венчаних",1946/1978,Прибудић,,,V1946/1978,"Матични уред Грачац",,"Државне матичне књиге",,Далмација,"Црквене матичне књиге",,,,,HRA-03486-1,"Матица обухваћа године: 1946-1971, 1974-1978.",,,"NO ACCESS",,,,arhivar1,Uzi
6880,"Матична књига умрлих",1946/1978,Прибудић,,,U1946/1978,"Матични уред Грачац",,"Државне матичне књиге",,Далмација,"Црквене матичне књиге",,,,,HRA-03487-1,"Матица обухваћа године: 1946-1952, 1959-1975, 1978.",,,"NO ACCESS",,,,arhivar1,Uzi
6907,"Матична књига рођених",1900-1902,Срб,,,R1900-1902,"Матични уред Грачац",,"Државне матичне књиге",,Далмација,"Црквене матичне књиге",,,,,HRA-03514-1,,,,"NO ACCESS",,,,arhivar1,Uzi
6908,"Матична књига рођених",1902-1905,Срб,,,R1902-1905,"Матични уред Грачац",,"Државне матичне књиге",,Далмација,"Црквене матичне књиге",,,,,HRA-03515-1,,,,"NO ACCESS",,,,arhivar1,Uzi
6909,"Матична књига рођених",1905-1907,Срб,,,R1905-1907,"Матични уред Грачац",,"Државне матичне књиге",,Далмација,"Црквене матичне књиге",,,,,HRA-03516-1,,,,"NO ACCESS",,,,arhivar1,Uzi
6910,"Матична књига рођених",1907-1907,Срб,,,R1907-1907,"Матични уред Грачац",,"Државне матичне књиге",,Далмација,"Црквене матичне књиге",,,,,HRA-03517-1,,,,"NO ACCESS",,,,arhivar1,Uzi
6911,"Матична књига рођених",1908-1910,Срб,,,R1908-1910,"Матични уред Грачац",,"Државне матичне књиге",,Далмација,"Црквене матичне књиге",,,,,HRA-03518-1,,,,"NO ACCESS",,,,arhivar1,Uzi
6912,"Матична књига рођених",1910-1912,Срб,,,R1910-1912,"Матични уред Грачац",,"Државне матичне књиге",,Далмација,"Црквене матичне књиге",,,,,HRA-03519-1,,,,"NO ACCESS",,,,arhivar1,Uzi
6913,"Матична књига рођених",1913-1915,Срб,,,R1913-1915,"Матични уред Грачац",,"Државне матичне књиге",,Далмација,"Црквене матичне књиге",,,,,HRA-03520-1,,,,"NO ACCESS",,,,arhivar1,Uzi
6914,"Матична књига рођених",1915-1920,Срб,,,R1915-1920,"Матични уред Грачац",,"Државне матичне књиге",,Далмација,"Црквене матичне књиге",,,,,HRA-03521-1,,,,"NO ACCESS",,,,arhivar1,Uzi
6915,"Матична књига рођених",1920-1922,Срб,,,R1920-1922,"Матични уред Грачац",,"Државне матичне књиге",,Далмација,"Црквене матичне књиге",,,,,HRA-03522-1,,,,"NO ACCESS",,,,arhivar1,Uzi
6916,"Матична књига рођених",1920-1922,Срб,,,R1920-1922,"Матични уред Грачац",,"Државне матичне књиге",,Далмација,"Црквене матичне књиге",,,,,HRA-03523-1,,,,"NO ACCESS",,,,arhivar1,Uzi
6917,"Матична књига рођених",1923-1925,Срб,,,R1923-1925,"Матични уред Грачац",,"Државне матичне књиге",,Далмација,"Црквене матичне књиге",,,,,HRA-03524-1,,,,"NO ACCESS",,,,arhivar1,Uzi
6918,"Матична књига рођених",1925-1927,Срб,,,R1925-1927,"Матични уред Грачац",,"Државне матичне књиге",,Далмација,"Црквене матичне књиге",,,,,HRA-03525-1,,,,"NO ACCESS",,,,arhivar1,Uzi
6919,"Матична књига рођених",1928-1929,Срб,,,R1928-1929,"Матични уред Грачац",,"Државне матичне књиге",,Далмација,"Црквене матичне књиге",,,,,HRA-03526-1,,,,"NO ACCESS",,,,arhivar1,Uzi
6920,"Матична књига рођених",1930-1932,Срб,,,R1930-1932,"Матични уред Грачац",,"Државне матичне књиге",,Далмација,"Црквене матичне књиге",,,,,HRA-03527-1,,,,"NO ACCESS",,,,arhivar1,Uzi
6921,"Матична књига рођених",1932-1934,Срб,,,R1932-1934,"Матични уред Грачац",,"Државне матичне књиге",,Далмација,"Црквене матичне књиге",,,,,HRA-03528-1,,,,"NO ACCESS",,,,arhivar1,Uzi