book_id,title,author_or_editor,isbn,publisher,source,num_red,place,copyright_year,categories,audience,area,kind_of,media,thumbnail_url,info_url,reference_url,reference_no,notes,note_ii,status,borrower_id,due_date,date_created,date_modified,created_by,modified_by
2284,,1894-1913,Прокупље,Прокупље,"Свети Прокопије",,"Историјски архив Прокупље",,,,"Источна Србија",Остало,,,https://www.poreklo.rs/2020/04/10/istorijski-arhiv-toplice-prokuplje/,,,,,,"NO ACCESS",,,,,
2283,,1937-1939,Куршумлија,Куршумлија,"Свете Тројице",,"Историјски архив Прокупље",,,,"Источна Србија",Остало,,,https://www.poreklo.rs/2020/04/10/istorijski-arhiv-toplice-prokuplje/,,,,,,"NO ACCESS",,,,,
2282,,1890-1902,Куршумлија,Куршумлија,"Светог Николе",,"Историјски архив Прокупље",,,,"Источна Србија",Остало,,,https://www.poreklo.rs/2020/04/10/istorijski-arhiv-toplice-prokuplje/,,,,,,"NO ACCESS",,,,,
2281,,1893-1905,Драгуша,Блаце,"Свети Илија",,"Историјски архив Прокупље",,,,"Источна Србија",Остало,,,https://www.poreklo.rs/2020/04/10/istorijski-arhiv-toplice-prokuplje/,,,,,,"NO ACCESS",,,,,
2280,,1891-1905,Блаце,Блаце,"Света Богородица Успенија",,"Историјски архив Прокупље",,,,"Источна Србија",Остало,,,https://www.poreklo.rs/2020/04/10/istorijski-arhiv-toplice-prokuplje/,,,,,,"NO ACCESS",,,,,
2184,"Матична књига умрлих",1900-1904,Врање,Врање,Сурдуличка,,"Архив Врање",,,,"Источна Србија","Црквене матичне књиге",,,https://www.poreklo.rs/2020/04/10/istorijski-arhiv-31-januar-vranje/,,,,,,"NO ACCESS",,,,,
2183,"Матична књига венчаних",1899-1908,Врање,Врање,Клисурска,,"Архив Врање",,,,"Источна Србија","Црквене матичне књиге",,,https://www.poreklo.rs/2020/04/10/istorijski-arhiv-31-januar-vranje/,,,"Суви дол, Драјинци",,,"NO ACCESS",,,,,
2182,"Матична књига умрлих",1899-1908,Врање,Врање,Клисурска,,"Архив Врање",,,,"Источна Србија","Црквене матичне књиге",,,https://www.poreklo.rs/2020/04/10/istorijski-arhiv-31-januar-vranje/,,,"Суви дол, Драјинци",,,"NO ACCESS",,,,,
2181,"Матична књига венчаних",1893-1921,Врање,Врање,Тибушка,,"Архив Врање",,,,"Источна Србија","Црквене матичне књиге",,,https://www.poreklo.rs/2020/04/10/istorijski-arhiv-31-januar-vranje/,,,парохије,,,"NO ACCESS",,,,,
2180,"Матична књига венчаних",1916,Врање,Врање,"Св Троице",,"Архив Врање",,,,"Источна Србија","Црквене матичне књиге",,,https://www.poreklo.rs/2020/04/10/istorijski-arhiv-31-januar-vranje/,,,"Панчевац, Кленике",,,"NO ACCESS",,,,,
2179,"Матична књига умрлих",1893-1911,Врање,Врање,Тибушка,,"Архив Врање",,,,"Источна Србија","Црквене матичне књиге",,,https://www.poreklo.rs/2020/04/10/istorijski-arhiv-31-januar-vranje/,,,"парохије, Златокоп, Дулан",,,"NO ACCESS",,,,,
2178,"Протокол брачно испитаних",1897-1911,Врање,Врање,Тибушка,,"Архив Врање",,,,"Источна Србија","Црквене матичне књиге",,,https://www.poreklo.rs/2020/04/10/istorijski-arhiv-31-januar-vranje/,,,,,,"NO ACCESS",,,,,
2177,"Матична књига венчаних",1893-1920,Врање,Врање,Топлачка,,"Архив Врање",,,,"Источна Србија","Црквене матичне књиге",,,https://www.poreklo.rs/2020/04/10/istorijski-arhiv-31-januar-vranje/,,,,,,"NO ACCESS",,,,,
2176,"Матична књига умрлих",1893-1920,Врање,Врање,Топлачка,,"Архив Врање",,,,"Источна Србија","Црквене матичне књиге",,,https://www.poreklo.rs/2020/04/10/istorijski-arhiv-31-januar-vranje/,,,,,,"NO ACCESS",,,,,
2175,"Матична књига венчаних",1893-1920,Врање,Врање,Требешињска,,"Архив Врање",,,,"Источна Србија","Црквене матичне књиге",,,https://www.poreklo.rs/2020/04/10/istorijski-arhiv-31-januar-vranje/,,,парохијска,,,"NO ACCESS",,,,,
2174,"Матична књига венчаних",1893-1915,Врање,Врање,Требешињска,,"Архив Врање",,,,"Источна Србија","Црквене матичне књиге",,,https://www.poreklo.rs/2020/04/10/istorijski-arhiv-31-januar-vranje/,,,парохијска,,,"NO ACCESS",,,,,
2173,"Матична књига умрлих",1893-1915,Врање,Врање,Требешињска,,"Архив Врање",,,,"Источна Србија","Црквене матичне књиге",,,https://www.poreklo.rs/2020/04/10/istorijski-arhiv-31-januar-vranje/,,,парохијска,,,"NO ACCESS",,,,,
2172,"Матична књига венчаних",1893-1915,Врање,Врање,Преображењска,,"Архив Врање",,,,"Источна Србија","Црквене матичне књиге",,,https://www.poreklo.rs/2020/04/10/istorijski-arhiv-31-januar-vranje/,,,"са Отуљом",,,"NO ACCESS",,,,,
2171,"Матична књига венчаних",1916-1918,Врање,Врање,Тесовишка,,"Архив Врање",,,,"Источна Србија","Црквене матичне књиге",,,https://www.poreklo.rs/2020/04/10/istorijski-arhiv-31-januar-vranje/,,,,,,"NO ACCESS",,,,,
2170,"Матична књига умрлих",1915-1918,Врање,Врање,Тесовишка,,"Архив Врање",,,,"Источна Србија","Црквене матичне књиге",,,https://www.poreklo.rs/2020/04/10/istorijski-arhiv-31-januar-vranje/,,,,,,"NO ACCESS",,,,,
2169,"Матична књига умрлих",1879-1915,Врање,Врање,Тесовишка,,"Архив Врање",,,,"Источна Србија","Црквене матичне књиге",,,https://www.poreklo.rs/2020/04/10/istorijski-arhiv-31-januar-vranje/,,,,,,"NO ACCESS",,,,,
2168,"Матична књига умрлих",1893-1907,Врање,Врање,Горњожапска,,"Архив Врање",,,,"Источна Србија","Црквене матичне књиге",,,https://www.poreklo.rs/2020/04/10/istorijski-arhiv-31-januar-vranje/,,,,,,"NO ACCESS",,,,,
2167,"Матична књига венчаних",1893-1901,Врање,Врање,Ратајска,,"Архив Врање",,,,"Источна Србија","Црквене матичне књиге",,,https://www.poreklo.rs/2020/04/10/istorijski-arhiv-31-januar-vranje/,,,,,,"NO ACCESS",,,,,
2166,"Матична књига венчаних",1879-1913,Врање,Врање,Стубалска,,"Архив Врање",,,,"Источна Србија","Црквене матичне књиге",,,https://www.poreklo.rs/2020/04/10/istorijski-arhiv-31-januar-vranje/,,,"више села",,,"NO ACCESS",,,,,
2165,"Матична књига умрлих",1907-1915,Врање,Врање,Стубалска,,"Архив Врање",,,,"Источна Србија","Црквене матичне књиге",,,https://www.poreklo.rs/2020/04/10/istorijski-arhiv-31-januar-vranje/,,,,,,"NO ACCESS",,,,,
2164,"Матична књига умрлих",1879-1907,Врање,Врање,Стубалска,,"Архив Врање",,,,"Источна Србија","Црквене матичне књиге",,,https://www.poreklo.rs/2020/04/10/istorijski-arhiv-31-januar-vranje/,,,,,,"NO ACCESS",,,,,
2163,"Матична књига умрлих",1879-1907,Врање,Врање,Содерачка,,"Архив Врање",,,,"Источна Србија","Црквене матичне књиге",,,https://www.poreklo.rs/2020/04/10/istorijski-arhiv-31-januar-vranje/,,,,,,"NO ACCESS",,,,,
2162,"Матична књига умрлих",1893-1915,Врање,Врање,Преображењска,,"Архив Врање",,,,"Источна Србија","Црквене матичне књиге",,,https://www.poreklo.rs/2020/04/10/istorijski-arhiv-31-januar-vranje/,,,,,,"NO ACCESS",,,,,
2161,"Матична књига венчаних",1879-1915,Врање,Врање,Градњанска,,"Архив Врање",,,,"Источна Србија","Црквене матичне књиге",,,https://www.poreklo.rs/2020/04/10/istorijski-arhiv-31-januar-vranje/,,,,,,"NO ACCESS",,,,,
2160,"Матична књига умрлих",1915,Врање,Врање,Големоселска,,"Архив Врање",,,,"Источна Србија","Црквене матичне књиге",,,https://www.poreklo.rs/2020/04/10/istorijski-arhiv-31-januar-vranje/,,,,,,"NO ACCESS",,,,,
2159,"Матична књига рођених",1879-1915,Врање,Врање,Градњанска,,"Архив Врање",,,,"Источна Србија","Црквене матичне књиге",,,https://www.poreklo.rs/2020/04/10/istorijski-arhiv-31-januar-vranje/,,,"пољаничка села",,,"NO ACCESS",,,,,
2158,"Матична књига рођених",1879-1924,Врање,Врање,Собинска,,"Архив Врање",,,,"Источна Србија","Црквене матичне књиге",,,https://www.poreklo.rs/2020/04/10/istorijski-arhiv-31-januar-vranje/,,,,,,"NO ACCESS",,,,,
2157,"Матична књига венчаних",1893-1910,Врање,Врање,,,"Архив Врање",,,,"Источна Србија","Црквене матичне књиге",,,https://www.poreklo.rs/2020/04/10/istorijski-arhiv-31-januar-vranje/,,,парохијска,,,"NO ACCESS",,,,,
2156,"Матична књига венчаних",1879-1920,Врање,Врање,"Св Троице",,"Архив Врање",,,,"Источна Србија","Црквене матичне књиге",,,https://www.poreklo.rs/2020/04/10/istorijski-arhiv-31-januar-vranje/,,,"са околним селима",,,"NO ACCESS",,,,,
2155,"Матична књига венчаних",1892-1904,Врање,Врање,"Св Троице",,"Архив Врање",,,,"Источна Србија","Црквене матичне књиге",,,https://www.poreklo.rs/2020/04/10/istorijski-arhiv-31-januar-vranje/,,,,,,"NO ACCESS",,,,,
2154,"Матична књига венчаних",1879-1892,Врање,Врање,"Св Троице",,"Архив Врање",,,,"Источна Србија","Црквене матичне књиге",,,https://www.poreklo.rs/2020/04/10/istorijski-arhiv-31-januar-vranje/,,,,,,"NO ACCESS",,,,,
2153,"Матична књига умрлих",1893-1905,Врање,Врање,,,"Архив Врање",,,,"Источна Србија","Црквене матичне књиге",,,https://www.poreklo.rs/2020/04/10/istorijski-arhiv-31-januar-vranje/,,,парохијска,,,"NO ACCESS",,,,,
2152,"Матична књига умрлих",1893-1911,Врање,Врање,,,"Архив Врање",,,,"Источна Србија","Црквене матичне књиге",,,https://www.poreklo.rs/2020/04/10/istorijski-arhiv-31-januar-vranje/,,,парохијска,,,"NO ACCESS",,,,,
2151,"Матична књига умрлих",1893-1909,Врање,Врање,,,"Архив Врање",,,,"Источна Србија","Црквене матичне књиге",,,https://www.poreklo.rs/2020/04/10/istorijski-arhiv-31-januar-vranje/,,,парохијска,,,"NO ACCESS",,,,,
2150,"Матична књига умрлих",1908-1913,Врање,Врање,"Св Троице",,"Архив Врање",,,,"Источна Србија","Црквене матичне књиге",,,https://www.poreklo.rs/2020/04/10/istorijski-arhiv-31-januar-vranje/,,,,,,"NO ACCESS",,,,,
2149,"Матична књига умрлих",1903-1908,Врање,Врање,"Св Троице",,"Архив Врање",,,,"Источна Србија","Црквене матичне књиге",,,https://www.poreklo.rs/2020/04/10/istorijski-arhiv-31-januar-vranje/,,,,,,"NO ACCESS",,,,,
2148,"Матична књига умрлих",1901-1903,Врање,Врање,"Св Троице",,"Архив Врање",,,,"Источна Србија","Црквене матичне књиге",,,https://www.poreklo.rs/2020/04/10/istorijski-arhiv-31-januar-vranje/,,,,,,"NO ACCESS",,,,,
2147,"Матична књига умрлих",1900-1901,Врање,Врање,"Св Троице",,"Архив Врање",,,,"Источна Србија","Црквене матичне књиге",,,https://www.poreklo.rs/2020/04/10/istorijski-arhiv-31-januar-vranje/,,,,,,"NO ACCESS",,,,,
2146,"Матична књига умрлих",1898-1900,Врање,Врање,"Св Троице",,"Архив Врање",,,,"Источна Србија","Црквене матичне књиге",,,https://www.poreklo.rs/2020/04/10/istorijski-arhiv-31-januar-vranje/,,,,,,"NO ACCESS",,,,,
2145,"Матична књига умрлих",1886-1892,Врање,Врање,"Св Троице",,"Архив Врање",,,,"Источна Србија","Црквене матичне књиге",,,https://www.poreklo.rs/2020/04/10/istorijski-arhiv-31-januar-vranje/,,,,,,"NO ACCESS",,,,,
2144,"Матична књига умрлих",1879-1886,Врање,Врање,"Св Троице",,"Архив Врање",,,,"Источна Србија","Црквене матичне књиге",,,https://www.poreklo.rs/2020/04/10/istorijski-arhiv-31-januar-vranje/,,,"и Златокоп, Ранутовац и Рибинце",,,"NO ACCESS",,,,,
2143,"Матична књига умрлих","1879-1886, 1893-1898",Врање,Врање,"Св Троице",,"Архив Врање",,,,"Источна Србија","Црквене матичне књиге",,,https://www.poreklo.rs/2020/04/10/istorijski-arhiv-31-januar-vranje/,,,,,,"NO ACCESS",,,,,
2142,"Матична књига умрлих",1879-1923,Врање,Врање,"Св Троице",,"Архив Врање",,,,"Источна Србија","Црквене матичне књиге",,,https://www.poreklo.rs/2020/04/10/istorijski-arhiv-31-januar-vranje/,,,регистар,,,"NO ACCESS",,,,,
2141,"Матична књига рођених",1893-1911,Врање,Врање,,,"Архив Врање",,,,"Источна Србија","Црквене матичне књиге",,,https://www.poreklo.rs/2020/04/10/istorijski-arhiv-31-januar-vranje/,,,"за парохију",,,"NO ACCESS",,,,,
2140,"Матична књига рођених",1890-1891,Врање,Врање,"Св Троице",,"Архив Врање",,,,"Источна Србија","Црквене матичне књиге",,,https://www.poreklo.rs/2020/04/10/istorijski-arhiv-31-januar-vranje/,,,,,,"NO ACCESS",,,,,
2139,"Матична књига рођених",1889-1890,Врање,Врање,"Св Троице",,"Архив Врање",,,,"Источна Србија","Црквене матичне књиге",,,https://www.poreklo.rs/2020/04/10/istorijski-arhiv-31-januar-vranje/,,,,,,"NO ACCESS",,,,,
2138,"Матична књига рођених",1884-1889,Врање,Врање,"Св Троице",,"Архив Врање",,,,"Источна Србија","Црквене матичне књиге",,,https://www.poreklo.rs/2020/04/10/istorijski-arhiv-31-januar-vranje/,,,,,,"NO ACCESS",,,,,
2137,"Матична књига рођених",1879-1884,Врање,Врање,"Св Троице",,"Архив Врање",,,,"Источна Србија","Црквене матичне књиге",,,https://www.poreklo.rs/2020/04/10/istorijski-arhiv-31-januar-vranje/,,,,,,"NO ACCESS",,,,,
2136,"Матична књига рођених",1879-1888,Врање,Врање,"Св Троице",,"Архив Врање",,,,"Источна Србија","Црквене матичне књиге",,,https://www.poreklo.rs/2020/04/10/istorijski-arhiv-31-januar-vranje/,,,,,,"NO ACCESS",,,,,
1773,"све три врсте",1837-?,,"Смедеревска паланка",,,"Архив Смедеревска Паланка",,,,"Источна Србија",Остало,,,https://www.poreklo.rs/2020/04/10/istorijski-arhiv-veroslava-dugosevic-smederevska-palanka/,,,"262 књиге",,,"NO ACCESS",,,,,
1772,"Матична књига рођених",1900-1912,Сараоци,Смедерево,,,"Историјски архив у Смедереву",,,,"Источна Србија","Црквене матичне књиге",,,https://www.poreklo.rs/2020/04/10/istorijski-arhiv-smederevo/,,,,,,"NO ACCESS",,,,,
1771,"Матична књига умрлих",1900-1906,Радинац,Смедерево,,,"Историјски архив у Смедереву",,,,"Источна Србија","Црквене матичне књиге",,,https://www.poreklo.rs/2020/04/10/istorijski-arhiv-smederevo/,,,"у књигама за Враново",,,"NO ACCESS",,,,,
1770,"Матична књига рођених",1850-1897,Биновац,Смедерево,,,"Историјски архив у Смедереву",,,,"Источна Србија","Црквене матичне књиге",,,https://www.poreklo.rs/2020/04/10/istorijski-arhiv-smederevo/,,,,,,"NO ACCESS",,,,,
1769,"Матична књига рођених",1900-1907,Лугавчина,Смедерево,,,"Историјски архив у Смедереву",,,,"Источна Србија","Црквене матичне књиге",,,https://www.poreklo.rs/2020/04/10/istorijski-arhiv-smederevo/,,,,,,"NO ACCESS",,,,,
1768,"Матична књига рођених",1900-1916,"Мало Орашје",Смедерево,,,"Историјски архив у Смедереву",,,,"Источна Србија","Црквене матичне књиге",,,https://www.poreklo.rs/2020/04/10/istorijski-arhiv-smederevo/,,,,,,"NO ACCESS",,,,,
1767,"Матична књига рођених",1900-1915,Михајловац,Смедерево,,,"Историјски архив у Смедереву",,,,"Источна Србија","Црквене матичне књиге",,,https://www.poreklo.rs/2020/04/10/istorijski-arhiv-smederevo/,,,,,,"NO ACCESS",,,,,
1766,"Матична књига рођених",1899-1915,Михајловац,Смедерево,,,"Историјски архив у Смедереву",,,,"Источна Србија","Црквене матичне књиге",,,https://www.poreklo.rs/2020/04/10/istorijski-arhiv-smederevo/,,,,,,"NO ACCESS",,,,,
1765,"Матична књига умрлих",1881-1920,Друговац,Смедерево,,,"Историјски архив у Смедереву",,,,"Источна Србија","Црквене матичне књиге",,,https://www.poreklo.rs/2020/04/10/istorijski-arhiv-smederevo/,,,,,,"NO ACCESS",,,,,
1764,"Матична књига венчаних",1881-1921,Друговац,Смедерево,,,"Историјски архив у Смедереву",,,,"Источна Србија","Црквене матичне књиге",,,https://www.poreklo.rs/2020/04/10/istorijski-arhiv-smederevo/,,,,,,"NO ACCESS",,,,,
1763,"Матична књига рођених",1881-1903,Друговац,Смедерево,,,"Историјски архив у Смедереву",,,,"Источна Србија","Црквене матичне књиге",,,https://www.poreklo.rs/2020/04/10/istorijski-arhiv-smederevo/,,,,,,"NO ACCESS",,,,,
1762,"Матична књига рођених",1872-1880,Друговац,Смедерево,,,"Историјски архив у Смедереву",,,,"Источна Србија","Црквене матичне књиге",,,https://www.poreklo.rs/2020/04/10/istorijski-arhiv-smederevo/,,,,,,"NO ACCESS",,,,,
1761,"Матична књига умрлих",1909-1914,Смедерево,Смедерево,,,"Историјски архив у Смедереву",,,,"Источна Србија","Црквене матичне књиге",,,https://www.poreklo.rs/2020/04/10/istorijski-arhiv-smederevo/,,,,,,"NO ACCESS",,,,,
1760,"Матична књига умрлих",1905-1909,Смедерево,Смедерево,,,"Историјски архив у Смедереву",,,,"Источна Србија","Црквене матичне књиге",,,https://www.poreklo.rs/2020/04/10/istorijski-arhiv-smederevo/,,,,,,"NO ACCESS",,,,,
1759,"Матична књига умрлих",1903-1905,Смедерево,Смедерево,,,"Историјски архив у Смедереву",,,,"Источна Србија","Црквене матичне књиге",,,https://www.poreklo.rs/2020/04/10/istorijski-arhiv-smederevo/,,,,,,"NO ACCESS",,,,,
1758,"Матична књига умрлих",1902-1903,Смедерево,Смедерево,,,"Историјски архив у Смедереву",,,,"Источна Србија","Црквене матичне књиге",,,https://www.poreklo.rs/2020/04/10/istorijski-arhiv-smederevo/,,,,,,"NO ACCESS",,,,,
1757,"Матична књига умрлих",1900-1902,Смедерево,Смедерево,,,"Историјски архив у Смедереву",,,,"Источна Србија","Црквене матичне књиге",,,https://www.poreklo.rs/2020/04/10/istorijski-arhiv-smederevo/,,,,,,"NO ACCESS",,,,,
1756,"Матична књига умрлих",1898-1899,Смедерево,Смедерево,,,"Историјски архив у Смедереву",,,,"Источна Србија","Црквене матичне књиге",,,https://www.poreklo.rs/2020/04/10/istorijski-arhiv-smederevo/,,,,,,"NO ACCESS",,,,,
1755,"Матична књига умрлих",1896-1898,Смедерево,Смедерево,,,"Историјски архив у Смедереву",,,,"Источна Србија","Црквене матичне књиге",,,https://www.poreklo.rs/2020/04/10/istorijski-arhiv-smederevo/,,,,,,"NO ACCESS",,,,,
1754,"Матична књига умрлих",1895-1896,Смедерево,Смедерево,,,"Историјски архив у Смедереву",,,,"Источна Србија","Црквене матичне књиге",,,https://www.poreklo.rs/2020/04/10/istorijski-arhiv-smederevo/,,,,,,"NO ACCESS",,,,,
1753,"Матична књига умрлих",1894-1895,Смедерево,Смедерево,,,"Историјски архив у Смедереву",,,,"Источна Србија","Црквене матичне књиге",,,https://www.poreklo.rs/2020/04/10/istorijski-arhiv-smederevo/,,,,,,"NO ACCESS",,,,,
1752,"Матична књига умрлих",1893-1894,Смедерево,Смедерево,,,"Историјски архив у Смедереву",,,,"Источна Србија","Црквене матичне књиге",,,https://www.poreklo.rs/2020/04/10/istorijski-arhiv-smederevo/,,,,,,"NO ACCESS",,,,,
1751,"Матична књига умрлих",1892-1893,Смедерево,Смедерево,,,"Историјски архив у Смедереву",,,,"Источна Србија","Црквене матичне књиге",,,https://www.poreklo.rs/2020/04/10/istorijski-arhiv-smederevo/,,,,,,"NO ACCESS",,,,,
1750,"Матична књига умрлих",1885-1892,Смедерево,Смедерево,,,"Историјски архив у Смедереву",,,,"Источна Србија","Црквене матичне књиге",,,https://www.poreklo.rs/2020/04/10/istorijski-arhiv-smederevo/,,,,,,"NO ACCESS",,,,,
1749,"Матична књига умрлих",1877-1885,Смедерево,Смедерево,,,"Историјски архив у Смедереву",,,,"Источна Србија","Црквене матичне књиге",,,https://www.poreklo.rs/2020/04/10/istorijski-arhiv-smederevo/,,,,,,"NO ACCESS",,,,,
1748,"Матична књига умрлих",1875-1877,Смедерево,Смедерево,,,"Историјски архив у Смедереву",,,,"Источна Србија","Црквене матичне књиге",,,https://www.poreklo.rs/2020/04/10/istorijski-arhiv-smederevo/,,,,,,"NO ACCESS",,,,,
1747,"Матична књига умрлих",1872-1875,Смедерево,Смедерево,,,"Историјски архив у Смедереву",,,,"Источна Србија","Црквене матичне књиге",,,https://www.poreklo.rs/2020/04/10/istorijski-arhiv-smederevo/,,,,,,"NO ACCESS",,,,,
1746,"Матична књига умрлих",1869-1872,Смедерево,Смедерево,,,"Историјски архив у Смедереву",,,,"Источна Србија","Црквене матичне књиге",,,https://www.poreklo.rs/2020/04/10/istorijski-arhiv-smederevo/,,,,,,"NO ACCESS",,,,,
1745,"Матична књига умрлих",1866-1869,Смедерево,Смедерево,,,"Историјски архив у Смедереву",,,,"Источна Србија","Црквене матичне књиге",,,https://www.poreklo.rs/2020/04/10/istorijski-arhiv-smederevo/,,,,,,"NO ACCESS",,,,,
1744,"Матична књига умрлих",1862-1866,Смедерево,Смедерево,,,"Историјски архив у Смедереву",,,,"Источна Србија","Црквене матичне књиге",,,https://www.poreklo.rs/2020/04/10/istorijski-arhiv-smederevo/,,,,,,"NO ACCESS",,,,,
1743,"Матична књига умрлих",1857-1862,Смедерево,Смедерево,,,"Историјски архив у Смедереву",,,,"Источна Србија","Црквене матичне књиге",,,https://www.poreklo.rs/2020/04/10/istorijski-arhiv-smederevo/,,,,,,"NO ACCESS",,,,,
1742,"Матична књига умрлих",1852-1861,Смедерево,Смедерево,,,"Историјски архив у Смедереву",,,,"Источна Србија","Црквене матичне књиге",,,https://www.poreklo.rs/2020/04/10/istorijski-arhiv-smederevo/,,,,,,"NO ACCESS",,,,,
1741,"Матична књига умрлих",1852-1857,Смедерево,Смедерево,,,"Историјски архив у Смедереву",,,,"Источна Србија","Црквене матичне књиге",,,https://www.poreklo.rs/2020/04/10/istorijski-arhiv-smederevo/,,,,,,"NO ACCESS",,,,,
1740,"Матична књига умрлих",1841-1849,Смедерево,Смедерево,,,"Историјски архив у Смедереву",,,,"Источна Србија","Црквене матичне књиге",,,https://www.poreklo.rs/2020/04/10/istorijski-arhiv-smederevo/,,,,,,"NO ACCESS",,,,,
1739,"Матична књига умрлих",1837-1844,Смедерево,Смедерево,,,"Историјски архив у Смедереву",,,,"Источна Србија","Црквене матичне књиге",,,https://www.poreklo.rs/2020/04/10/istorijski-arhiv-smederevo/,,,,,,"NO ACCESS",,,,,
1738,"Матична књига венчаних",1891-1902,Смедерево,Смедерево,,,"Историјски архив у Смедереву",,,,"Источна Србија","Црквене матичне књиге",,,https://www.poreklo.rs/2020/04/10/istorijski-arhiv-smederevo/,,,,,,"NO ACCESS",,,,,
1737,"Матична књига венчаних",1879-1891,Смедерево,Смедерево,,,"Историјски архив у Смедереву",,,,"Источна Србија","Црквене матичне књиге",,,https://www.poreklo.rs/2020/04/10/istorijski-arhiv-smederevo/,,,,,,"NO ACCESS",,,,,
1736,"Матична књига венчаних",1879-1884,Смедерево,Смедерево,,,"Историјски архив у Смедереву",,,,"Источна Србија","Црквене матичне књиге",,,https://www.poreklo.rs/2020/04/10/istorijski-arhiv-smederevo/,,,,,,"NO ACCESS",,,,,
1735,"Матична књига венчаних",1850-1860,Смедерево,Смедерево,,,"Историјски архив у Смедереву",,,,"Источна Србија","Црквене матичне књиге",,,https://www.poreklo.rs/2020/04/10/istorijski-arhiv-smederevo/,,,,,,"NO ACCESS",,,,,
1734,"Матична књига венчаних",1837-1850,Смедерево,Смедерево,,,"Историјски архив у Смедереву",,,,"Источна Србија","Црквене матичне књиге",,,https://www.poreklo.rs/2020/04/10/istorijski-arhiv-smederevo/,,,,,,"NO ACCESS",,,,,
1733,"Матична књига рођених",1911-1915,Смедерево,Смедерево,,,"Историјски архив у Смедереву",,,,"Источна Србија","Црквене матичне књиге",,,https://www.poreklo.rs/2020/04/10/istorijski-arhiv-smederevo/,,,,,,"NO ACCESS",,,,,
1732,"Матична књига рођених",1900-1911,Смедерево,Смедерево,,,"Историјски архив у Смедереву",,,,"Источна Србија","Црквене матичне књиге",,,https://www.poreklo.rs/2020/04/10/istorijski-arhiv-smederevo/,,,,,,"NO ACCESS",,,,,
1731,"Матична књига рођених",1901-1902,Смедерево,Смедерево,,,"Историјски архив у Смедереву",,,,"Источна Србија","Црквене матичне књиге",,,https://www.poreklo.rs/2020/04/10/istorijski-arhiv-smederevo/,,,,,,"NO ACCESS",,,,,
1730,"Матична књига рођених",1899-1900,Смедерево,Смедерево,,,"Историјски архив у Смедереву",,,,"Источна Србија","Црквене матичне књиге",,,https://www.poreklo.rs/2020/04/10/istorijski-arhiv-smederevo/,,,,,,"NO ACCESS",,,,,
1729,"Матична књига рођених",1898-1899,Смедерево,Смедерево,,,"Историјски архив у Смедереву",,,,"Источна Србија","Црквене матичне књиге",,,https://www.poreklo.rs/2020/04/10/istorijski-arhiv-smederevo/,,,,,,"NO ACCESS",,,,,
1728,"Матична књига рођених",1892-1898,Смедерево,Смедерево,,,"Историјски архив у Смедереву",,,,"Источна Србија","Црквене матичне књиге",,,https://www.poreklo.rs/2020/04/10/istorijski-arhiv-smederevo/,,,,,,"NO ACCESS",,,,,
1727,"Матична књига рођених",1890-1892,Смедерево,Смедерево,,,"Историјски архив у Смедереву",,,,"Источна Србија","Црквене матичне књиге",,,https://www.poreklo.rs/2020/04/10/istorijski-arhiv-smederevo/,,,,,,"NO ACCESS",,,,,
1726,"Матична књига рођених",1888-1889,Смедерево,Смедерево,,,"Историјски архив у Смедереву",,,,"Источна Србија","Црквене матичне књиге",,,https://www.poreklo.rs/2020/04/10/istorijski-arhiv-smederevo/,,,,,,"NO ACCESS",,,,,
1725,"Матична књига рођених",1887-1888,Смедерево,Смедерево,,,"Историјски архив у Смедереву",,,,"Источна Србија","Црквене матичне књиге",,,https://www.poreklo.rs/2020/04/10/istorijski-arhiv-smederevo/,,,,,,"NO ACCESS",,,,,
1724,"Матична књига рођених",1880-1887,Смедерево,Смедерево,,,"Историјски архив у Смедереву",,,,"Источна Србија","Црквене матичне књиге",,,https://www.poreklo.rs/2020/04/10/istorijski-arhiv-smederevo/,,,,,,"NO ACCESS",,,,,
1723,"Матична књига рођених",1876-1880,Смедерево,Смедерево,,,"Историјски архив у Смедереву",,,,"Источна Србија","Црквене матичне књиге",,,https://www.poreklo.rs/2020/04/10/istorijski-arhiv-smederevo/,,,,,,"NO ACCESS",,,,,
1722,"Матична књига рођених",1869-1872,Смедерево,Смедерево,,,"Историјски архив у Смедереву",,,,"Источна Србија","Црквене матичне књиге",,,https://www.poreklo.rs/2020/04/10/istorijski-arhiv-smederevo/,,,,,,"NO ACCESS",,,,,
1721,"Матична књига рођених",1865-1869,Смедерево,Смедерево,,,"Историјски архив у Смедереву",,,,"Источна Србија","Црквене матичне књиге",,,https://www.poreklo.rs/2020/04/10/istorijski-arhiv-smederevo/,,,,,,"NO ACCESS",,,,,
1720,"Матична књига рођених",1861-1865,Смедерево,Смедерево,,,"Историјски архив у Смедереву",,,,"Источна Србија","Црквене матичне књиге",,,https://www.poreklo.rs/2020/04/10/istorijski-arhiv-smederevo/,,,,,,"NO ACCESS",,,,,