book_id,title,author_or_editor,isbn,publisher,source,num_red,place,copyright_year,categories,audience,area,kind_of,media,thumbnail_url,info_url,reference_url,reference_no,notes,note_ii,status,borrower_id,due_date,date_created,date_modified,created_by,modified_by
1410,,,Корбово,Кладово,"Св апостола Петра и Павла",,"Историјски архив Неготин",,,,"Источна Србија",Остало,,,https://www.poreklo.rs/2020/04/10/istorijski-arhiv-negotin/,,,"3 књиге",,,"NO ACCESS",,,,,
1418,,,Неготин,Неготин,"Рођења Пресвете Богородице",,"Историјски архив Неготин",,,,"Источна Србија",Остало,,,https://www.poreklo.rs/2020/04/10/istorijski-arhiv-negotin/,,,,,,"NO ACCESS",,,,,
1435,,,Димитровград,Димитровград,"Рођења Пресвете Богородице",,"Историјски архив Пирот",,,,"Источна Србија",Остало,,,https://www.poreklo.rs/2020/04/10/istorijski-arhiv-pirot/,,,,,,"NO ACCESS",,,,,
1436,,,Пирот,Пирот,"Рођење Христово",,"Историјски архив Пирот",,,,"Источна Србија",Остало,,,https://www.poreklo.rs/2020/04/10/istorijski-arhiv-pirot/,,,,,,"NO ACCESS",,,,,
1437,,,Завој,Пирот,"Вазнесења Господњег",,"Историјски архив Пирот",,,,"Источна Србија",Остало,,,https://www.poreklo.rs/2020/04/10/istorijski-arhiv-pirot/,,,,,,"NO ACCESS",,,,,
1438,,,Станичење,Пирот,"Света Петка",,"Историјски архив Пирот",,,,"Источна Србија",Остало,,,https://www.poreklo.rs/2020/04/10/istorijski-arhiv-pirot/,,,,,,"NO ACCESS",,,,,
1439,,,"Брестов Дол",Бабушница,"Свете Петке",,"Историјски архив Пирот",,,,"Источна Србија",Остало,,,https://www.poreklo.rs/2020/04/10/istorijski-arhiv-pirot/,,,,,,"NO ACCESS",,,,,
1440,,,Горчинци,Бабушница,"Свете Петке",,"Историјски архив Пирот",,,,"Источна Србија",Остало,,,https://www.poreklo.rs/2020/04/10/istorijski-arhiv-pirot/,,,,,,"NO ACCESS",,,,,
1441,,,Гуленовци,Димитровград,"Свете Тројице",,"Историјски архив Пирот",,,,"Источна Србија",Остало,,,https://www.poreklo.rs/2020/04/10/istorijski-arhiv-pirot/,,,,,,"NO ACCESS",,,,,
1442,,,Извор,Бабушница,"Свете Тројице",,"Историјски архив Пирот",,,,"Источна Србија",Остало,,,https://www.poreklo.rs/2020/04/10/istorijski-arhiv-pirot/,,,,,,"NO ACCESS",,,,,
1443,,,Лукавица,Димитровград,"Свете Тројице",,"Историјски архив Пирот",,,,"Источна Србија",Остало,,,https://www.poreklo.rs/2020/04/10/istorijski-arhiv-pirot/,,,,,,"NO ACCESS",,,,,
1444,,,Чиниглавци,Пирот,"Светог Архангела Михаила",,"Историјски архив Пирот",,,,"Источна Србија",Остало,,,https://www.poreklo.rs/2020/04/10/istorijski-arhiv-pirot/,,,,,,"NO ACCESS",,,,,
1445,,,Радејна,Димитровград,"Светог Ваведења",,"Историјски архив Пирот",,,,"Источна Србија",Остало,,,https://www.poreklo.rs/2020/04/10/istorijski-arhiv-pirot/,,,,,,"NO ACCESS",,,,,
1446,,,Сенокос,Димитровград,"Светог Великомученика Пантелејмона",,"Историјски архив Пирот",,,,"Источна Србија",Остало,,,https://www.poreklo.rs/2020/04/10/istorijski-arhiv-pirot/,,,,,,"NO ACCESS",,,,,
1447,,,Завидинце,Бабушница,"Светог Ђорђа",,"Историјски архив Пирот",,,,"Источна Србија",Остало,,,https://www.poreklo.rs/2020/04/10/istorijski-arhiv-pirot/,,,,,,"NO ACCESS",,,,,
1448,,,Петровац,Пирот,"Светог Ђорђа",,"Историјски архив Пирот",,,,"Источна Србија",Остало,,,https://www.poreklo.rs/2020/04/10/istorijski-arhiv-pirot/,,,,,,"NO ACCESS",,,,,
1449,,,Славиња,Пирот,"Светог Ђорђа",,"Историјски архив Пирот",,,,"Источна Србија",Остало,,,https://www.poreklo.rs/2020/04/10/istorijski-arhiv-pirot/,,,,,,"NO ACCESS",,,,,
1450,,,"Велики Суводол",Пирот,"Светог Игњатија Богоносца",,"Историјски архив Пирот",,,,"Источна Србија",Остало,,,https://www.poreklo.rs/2020/04/10/istorijski-arhiv-pirot/,,,,,,"NO ACCESS",,,,,
1451,,,Сопот,Пирот,"Светог Илије",,"Историјски архив Пирот",,,,"Источна Србија",Остало,,,https://www.poreklo.rs/2020/04/10/istorijski-arhiv-pirot/,,,,,,"NO ACCESS",,,,,
1452,,,"Добри До",Пирот,"Светог Јована",,"Историјски архив Пирот",,,,"Источна Србија",Остало,,,https://www.poreklo.rs/2020/04/10/istorijski-arhiv-pirot/,,,,,,"NO ACCESS",,,,,
1453,,,Гостуша,Пирот,"Светог Јована Крститеља",,"Историјски архив Пирот",,,,"Источна Србија",Остало,,,https://www.poreklo.rs/2020/04/10/istorijski-arhiv-pirot/,,,,,,"NO ACCESS",,,,,
1454,,,Расница,Пирот,"Светог Козме и Дамјана",,"Историјски архив Пирот",,,,"Источна Србија",Остало,,,https://www.poreklo.rs/2020/04/10/istorijski-arhiv-pirot/,,,,,,"NO ACCESS",,,,,
1455,,,"Велико Боњинце",Бабушница,"Светог Николе",,"Историјски архив Пирот",,,,"Источна Србија",Остало,,,https://www.poreklo.rs/2020/04/10/istorijski-arhiv-pirot/,,,,,,"NO ACCESS",,,,,
1456,,,Дојкинци,Пирот,"Светог Николе",,"Историјски архив Пирот",,,,"Источна Србија",Остало,,,https://www.poreklo.rs/2020/04/10/istorijski-arhiv-pirot/,,,,,,"NO ACCESS",,,,,
1457,,,Крупац,"Бела Паланка","Светог Николе",,"Историјски архив Пирот",,,,"Источна Србија",Остало,,,https://www.poreklo.rs/2020/04/10/istorijski-arhiv-pirot/,,,,,,"NO ACCESS",,,,,
1458,,,Стрижевац,Бабушница,"Светог Николе",,"Историјски архив Пирот",,,,"Источна Србија",Остало,,,https://www.poreklo.rs/2020/04/10/istorijski-arhiv-pirot/,,,,,,"NO ACCESS",,,,,
1459,,,Базовик,Пирот,"Светог Онуфрија",,"Историјски архив Пирот",,,,"Источна Србија",Остало,,,https://www.poreklo.rs/2020/04/10/istorijski-arhiv-pirot/,,,,,,"NO ACCESS",,,,,
1460,,,Градиње,Димитровград,"Светог Спаса",,"Историјски архив Пирот",,,,"Источна Србија",Остало,,,https://www.poreklo.rs/2020/04/10/istorijski-arhiv-pirot/,,,,,,"NO ACCESS",,,,,
1461,,,Костур,Пирот,"Светог Харалампија",,"Историјски архив Пирот",,,,"Источна Србија",Остало,,,https://www.poreklo.rs/2020/04/10/istorijski-arhiv-pirot/,,,,,,"NO ACCESS",,,,,
1462,,,"Црвена Јабука",Бабушница,"Светог цара Константина и царице Јелене",,"Историјски архив Пирот",,,,"Источна Србија",Остало,,,https://www.poreklo.rs/2020/04/10/istorijski-arhiv-pirot/,,,,,,"NO ACCESS",,,,,
1463,,,Стрелац,Бабушница,"Успења Пресвете Богородице",,"Историјски архив Пирот",,,,"Источна Србија",Остало,,,https://www.poreklo.rs/2020/04/10/istorijski-arhiv-pirot/,,,,,,"NO ACCESS",,,,,
1464,,,Пирот,Пирот,"Успења Пресвете Богородице",,"Историјски архив Пирот",,,,"Источна Србија",Остало,,,https://www.poreklo.rs/2020/04/10/istorijski-arhiv-pirot/,,,,,,"NO ACCESS",,,,,
1409,,1837-1880,Каменица,Кладово,"Св Параскеве",,"Историјски архив Неготин",,,,"Источна Србија",Остало,,,https://www.poreklo.rs/2020/04/10/istorijski-arhiv-negotin/,,,"2 књиге",,,"NO ACCESS",,,,,
1429,,1837-1880,Тамнич,Неготин,"Свете Тројице",,"Историјски архив Неготин",,,,"Источна Србија",Остало,,,https://www.poreklo.rs/2020/04/10/istorijski-arhiv-negotin/,,,"2 књиге",,,"NO ACCESS",,,,,
1426,,1837-1895,Самариновац,Неготин,"Свете Тројице",,"Историјски архив Неготин",,,,"Источна Србија",Остало,,,https://www.poreklo.rs/2020/04/10/istorijski-arhiv-negotin/,,,"4 књиге",,,"NO ACCESS",,,,,
1423,,1837-1900,Речка,Неготин,,,"Историјски архив Неготин",,,,"Источна Србија",Остало,,,https://www.poreklo.rs/2020/04/10/istorijski-arhiv-negotin/,,,"23 књиге",,,"NO ACCESS",,,,,
1419,,1837-1905,Неготин,Неготин,"Свете Тројице",,"Историјски архив Неготин",,,,"Источна Србија",Остало,,,https://www.poreklo.rs/2020/04/10/istorijski-arhiv-negotin/,,,"13 књига",,,"NO ACCESS",,,,,
1412,,1837-1906,"Доњи Милановац",Мајданпек,"Св оца Николаја",,"Историјски архив Неготин",,,,"Источна Србија",Остало,,,https://www.poreklo.rs/2020/04/10/istorijski-arhiv-negotin/,,,"15 књига",,,"NO ACCESS",,,,,
1414,,1837-1906,Јабуковац,Неготин,"Вазнесења Господњег",,"Историјски архив Неготин",,,,"Источна Србија",Остало,,,https://www.poreklo.rs/2020/04/10/istorijski-arhiv-negotin/,,,"18 књига",,,"NO ACCESS",,,,,
1416,,1837-1906,Михајловац,Неготин,"Св архангела Михаила",,"Историјски архив Неготин",,,,"Источна Србија",Остало,,,https://www.poreklo.rs/2020/04/10/istorijski-arhiv-negotin/,,,"8 књига",,,"NO ACCESS",,,,,
1430,,1837-1906,Уровица,Неготин,"Св оца Николаја",,"Историјски архив Неготин",,,,"Источна Србија",Остало,,,https://www.poreklo.rs/2020/04/10/istorijski-arhiv-negotin/,,,"7 књига",,,"NO ACCESS",,,,,
1433,,1837-1906,Злот,Бор,"Св пророка Илије",,"Историјски архив Неготин",,,,"Источна Србија",Остало,,,https://www.poreklo.rs/2020/04/10/istorijski-arhiv-negotin/,,,"оделење Бор, 19 књига",,,"NO ACCESS",,,,,
1431,,1837-1907,Штубик,Неготин,"Свете Тројице",,"Историјски архив Неготин",,,,"Источна Србија",Остало,,,https://www.poreklo.rs/2020/04/10/istorijski-arhiv-negotin/,,,"12 књига",,,"NO ACCESS",,,,,
1405,,1837-1909,Буково,Неготин,"Св оца Николаја",,"Историјски архив Неготин",,,,"Источна Србија",Остало,,,https://www.poreklo.rs/2020/04/10/istorijski-arhiv-negotin/,,,"манастир, 18 књига",,,"NO ACCESS",,,,,
1406,,1837-1924,Брестовац,Неготин,"Вазнесења Господњег",,"Историјски архив Неготин",,,,"Источна Србија",Остало,,,https://www.poreklo.rs/2020/04/10/istorijski-arhiv-negotin/,,,"4 књиге",,,"NO ACCESS",,,,,
1408,,1838-1888,Вајуга,Кладово,"Св архангела Михаила",,"Историјски архив Неготин",,,,"Источна Србија",Остало,,,https://www.poreklo.rs/2020/04/10/istorijski-arhiv-negotin/,,,"3 књиге",,,"NO ACCESS",,,,,
1424,,1840-1899,Сип,Кладово,"Св оца Николаја",,"Историјски архив Неготин",,,,"Источна Србија",Остало,,,https://www.poreklo.rs/2020/04/10/istorijski-arhiv-negotin/,,,"2 књиге",,,"NO ACCESS",,,,,
1415,,1853-1874,Мајданпек,Мајданпек,"Св апостола Петра и Павла",,"Историјски архив Неготин",,,,"Источна Србија",Остало,,,https://www.poreklo.rs/2020/04/10/istorijski-arhiv-negotin/,,,"1 књига",,,"NO ACCESS",,,,,
1413,,1858-1910,Душановац,Неготин,"Успења Пресвете Богородице",,"Историјски архив Неготин",,,,"Источна Србија",Остало,,,https://www.poreklo.rs/2020/04/10/istorijski-arhiv-negotin/,,,"18 књига",,,"NO ACCESS",,,,,
1425,,1861-1904,Сиколе,Неготин,"Вазнесења Господњег",,"Историјски архив Неготин",,,,"Источна Србија",Остало,,,https://www.poreklo.rs/2020/04/10/istorijski-arhiv-negotin/,,,"8 књига",,,"NO ACCESS",,,,,
1434,,1861-1906,Слатина,Неготин,"Пресвете Богородице",,"Историјски архив Неготин",,,,"Источна Србија",Остало,,,https://www.poreklo.rs/2020/04/10/istorijski-arhiv-negotin/,,,"оделење Бор, 12 књига",,,"NO ACCESS",,,,,
1420,,1865-1876,Плавна,Неготин,,,"Историјски архив Неготин",,,,"Источна Србија",Остало,,,https://www.poreklo.rs/2020/04/10/istorijski-arhiv-negotin/,,,"1 књига",,,"NO ACCESS",,,,,
1417,,1869-1878,Мокрање,Неготин,"Св Троице",,"Историјски архив Неготин",,,,"Источна Србија",Остало,,,https://www.poreklo.rs/2020/04/10/istorijski-arhiv-negotin/,,,"5 књига",,,"NO ACCESS",,,,,
1421,,1871-1888,"Рудна глава",Мајданпек,"Светог Саве",,"Историјски архив Неготин",,,,"Источна Србија",Остало,,,https://www.poreklo.rs/2020/04/10/istorijski-arhiv-negotin/,,,"1 књига",,,"NO ACCESS",,,,,
1427,,1872-1909,Трњане,Неготин,"Свете Тројице",,"Историјски архив Неготин",,,,"Источна Србија",Остало,,,https://www.poreklo.rs/2020/04/10/istorijski-arhiv-negotin/,,,"2 књиге",,,"NO ACCESS",,,,,
2282,,1890-1902,Куршумлија,Куршумлија,"Светог Николе",,"Историјски архив Прокупље",,,,"Источна Србија",Остало,,,https://www.poreklo.rs/2020/04/10/istorijski-arhiv-toplice-prokuplje/,,,,,,"NO ACCESS",,,,,
1428,,1890-1908,Србово,Неготин,"Вазнесења Господњег",,"Историјски архив Неготин",,,,"Источна Србија",Остало,,,https://www.poreklo.rs/2020/04/10/istorijski-arhiv-negotin/,,,"1 књига",,,"NO ACCESS",,,,,
1432,,1890-1909,Лука,Бор,"Силаска Светог Духа",,"Историјски архив Неготин",,,,"Источна Србија",Остало,,,https://www.poreklo.rs/2020/04/10/istorijski-arhiv-negotin/,,,"оделење Бор, 1 књига",,,"NO ACCESS",,,,,
1422,,1891-1894,Радујевац,Неготин,"Вазнесења Господњег",,"Историјски архив Неготин",,,,"Источна Србија",Остало,,,https://www.poreklo.rs/2020/04/10/istorijski-arhiv-negotin/,,,"1 књига",,,"NO ACCESS",,,,,
2280,,1891-1905,Блаце,Блаце,"Света Богородица Успенија",,"Историјски архив Прокупље",,,,"Источна Србија",Остало,,,https://www.poreklo.rs/2020/04/10/istorijski-arhiv-toplice-prokuplje/,,,,,,"NO ACCESS",,,,,
1466,,1891-1952,Драговац,Пожаревац,"Светог Оца Николаја",,"Историјски архив Пожаревац",,,,"Источна Србија",Остало,,,https://www.poreklo.rs/2020/04/10/istorijski-arhiv-pozarevac/,,,,,,"NO ACCESS",,,,,
2281,,1893-1905,Драгуша,Блаце,"Свети Илија",,"Историјски архив Прокупље",,,,"Источна Србија",Остало,,,https://www.poreklo.rs/2020/04/10/istorijski-arhiv-toplice-prokuplje/,,,,,,"NO ACCESS",,,,,
2284,,1894-1913,Прокупље,Прокупље,"Свети Прокопије",,"Историјски архив Прокупље",,,,"Источна Србија",Остало,,,https://www.poreklo.rs/2020/04/10/istorijski-arhiv-toplice-prokuplje/,,,,,,"NO ACCESS",,,,,
1467,,1895-1949,Пожаревац,Пожаревац,,,"Историјски архив Пожаревац",,,,"Источна Србија",Остало,,,https://www.poreklo.rs/2020/04/10/istorijski-arhiv-pozarevac/,,,,,,"NO ACCESS",,,,,
1407,,1901-1910,Видровац,Неготин,"Св оца Николаја",,"Историјски архив Неготин",,,,"Источна Србија",Остало,,,https://www.poreklo.rs/2020/04/10/istorijski-arhiv-negotin/,,,"2 књиге",,,"NO ACCESS",,,,,
1468,,1919-1926,"Велико Градиште","Велико Градиште",,,"Историјски архив Пожаревац",,,,"Источна Србија",Остало,,,https://www.poreklo.rs/2020/04/10/istorijski-arhiv-pozarevac/,,,,,,"NO ACCESS",,,,,
1470,,1931-1934,Мајиловац,"Велико Градиште",,,"Историјски архив Пожаревац",,,,"Источна Србија",Остало,,,https://www.poreklo.rs/2020/04/10/istorijski-arhiv-pozarevac/,,,,,,"NO ACCESS",,,,,
1465,,1935-1939,Сираково,"Велико Градиште",,,"Историјски архив Пожаревац",,,,"Источна Србија",Остало,,,https://www.poreklo.rs/2020/04/10/istorijski-arhiv-pozarevac/,,,,,,"NO ACCESS",,,,,
1469,,1935-1939,Курјаче,"Велико Градиште",,,"Историјски архив Пожаревац",,,,"Источна Србија",Остало,,,https://www.poreklo.rs/2020/04/10/istorijski-arhiv-pozarevac/,,,,,,"NO ACCESS",,,,,
2283,,1937-1939,Куршумлија,Куршумлија,"Свете Тројице",,"Историјски архив Прокупље",,,,"Источна Србија",Остало,,,https://www.poreklo.rs/2020/04/10/istorijski-arhiv-toplice-prokuplje/,,,,,,"NO ACCESS",,,,,
1734,"Матична књига венчаних",1837-1850,Смедерево,Смедерево,,,"Историјски архив у Смедереву",,,,"Источна Србија","Црквене матичне књиге",,,https://www.poreklo.rs/2020/04/10/istorijski-arhiv-smederevo/,,,,,,"NO ACCESS",,,,,
1673,"Матична књига венчаних",1837-1856,Колари,Смедерево,,,"Историјски архив у Смедереву",,,,"Источна Србија","Црквене матичне књиге",,,https://www.poreklo.rs/2020/04/10/istorijski-arhiv-smederevo/,,,,,,"NO ACCESS",,,,,
1711,"Матична књига венчаних",1845-1879,Липе,Смедерево,,,"Историјски архив у Смедереву",,,,"Источна Србија","Црквене матичне књиге",,,https://www.poreklo.rs/2020/04/10/istorijski-arhiv-smederevo/,,,,,,"NO ACCESS",,,,,
1735,"Матична књига венчаних",1850-1860,Смедерево,Смедерево,,,"Историјски архив у Смедереву",,,,"Источна Србија","Црквене матичне књиге",,,https://www.poreklo.rs/2020/04/10/istorijski-arhiv-smederevo/,,,,,,"NO ACCESS",,,,,
1674,"Матична књига венчаних",1857-1867,Колари,Смедерево,,,"Историјски архив у Смедереву",,,,"Источна Србија","Црквене матичне књиге",,,https://www.poreklo.rs/2020/04/10/istorijski-arhiv-smederevo/,,,,,,"NO ACCESS",,,,,
1675,"Матична књига венчаних",1867-1880,Колари,Смедерево,,,"Историјски архив у Смедереву",,,,"Источна Србија","Црквене матичне књиге",,,https://www.poreklo.rs/2020/04/10/istorijski-arhiv-smederevo/,,,,,,"NO ACCESS",,,,,
1676,"Матична књига венчаних",1872-1880,Колари,Смедерево,,,"Историјски архив у Смедереву",,,,"Источна Србија","Црквене матичне књиге",,,https://www.poreklo.rs/2020/04/10/istorijski-arhiv-smederevo/,,,,,,"NO ACCESS",,,,,
1736,"Матична књига венчаних",1879-1884,Смедерево,Смедерево,,,"Историјски архив у Смедереву",,,,"Источна Србија","Црквене матичне књиге",,,https://www.poreklo.rs/2020/04/10/istorijski-arhiv-smederevo/,,,,,,"NO ACCESS",,,,,
1737,"Матична књига венчаних",1879-1891,Смедерево,Смедерево,,,"Историјски архив у Смедереву",,,,"Источна Србија","Црквене матичне књиге",,,https://www.poreklo.rs/2020/04/10/istorijski-arhiv-smederevo/,,,,,,"NO ACCESS",,,,,
2154,"Матична књига венчаних",1879-1892,Врање,Врање,"Св Троице",,"Архив Врање",,,,"Источна Србија","Црквене матичне књиге",,,https://www.poreklo.rs/2020/04/10/istorijski-arhiv-31-januar-vranje/,,,,,,"NO ACCESS",,,,,
2166,"Матична књига венчаних",1879-1913,Врање,Врање,Стубалска,,"Архив Врање",,,,"Источна Србија","Црквене матичне књиге",,,https://www.poreklo.rs/2020/04/10/istorijski-arhiv-31-januar-vranje/,,,"више села",,,"NO ACCESS",,,,,
2161,"Матична књига венчаних",1879-1915,Врање,Врање,Градњанска,,"Архив Врање",,,,"Источна Србија","Црквене матичне књиге",,,https://www.poreklo.rs/2020/04/10/istorijski-arhiv-31-januar-vranje/,,,,,,"NO ACCESS",,,,,
2156,"Матична књига венчаних",1879-1920,Врање,Врање,"Св Троице",,"Архив Врање",,,,"Источна Србија","Црквене матичне књиге",,,https://www.poreklo.rs/2020/04/10/istorijski-arhiv-31-januar-vranje/,,,"са околним селима",,,"NO ACCESS",,,,,
1677,"Матична књига венчаних",1880-1901,Колари,Смедерево,,,"Историјски архив у Смедереву",,,,"Источна Србија","Црквене матичне књиге",,,https://www.poreklo.rs/2020/04/10/istorijski-arhiv-smederevo/,,,,,,"NO ACCESS",,,,,
1712,"Матична књига венчаних",1880-1914/1915,Липе,Смедерево,,,"Историјски архив у Смедереву",,,,"Источна Србија","Црквене матичне књиге",,,https://www.poreklo.rs/2020/04/10/istorijski-arhiv-smederevo/,,,,,,"NO ACCESS",,,,,
1702,"Матична књига венчаних",1881-1906,Враново,Смедерево,,,"Историјски архив у Смедереву",,,,"Источна Србија","Црквене матичне књиге",,,https://www.poreklo.rs/2020/04/10/istorijski-arhiv-smederevo/,,,,,,"NO ACCESS",,,,,
1764,"Матична књига венчаних",1881-1921,Друговац,Смедерево,,,"Историјски архив у Смедереву",,,,"Источна Србија","Црквене матичне књиге",,,https://www.poreklo.rs/2020/04/10/istorijski-arhiv-smederevo/,,,,,,"NO ACCESS",,,,,
1693,"Матична књига венчаних",1884-1925,Скобаљ,Смедерево,,,"Историјски архив у Смедереву",,,,"Источна Србија","Црквене матичне књиге",,,https://www.poreklo.rs/2020/04/10/istorijski-arhiv-smederevo/,,,,,,"NO ACCESS",,,,,
1738,"Матична књига венчаних",1891-1902,Смедерево,Смедерево,,,"Историјски архив у Смедереву",,,,"Источна Србија","Црквене матичне књиге",,,https://www.poreklo.rs/2020/04/10/istorijski-arhiv-smederevo/,,,,,,"NO ACCESS",,,,,
2155,"Матична књига венчаних",1892-1904,Врање,Врање,"Св Троице",,"Архив Врање",,,,"Источна Србија","Црквене матичне књиге",,,https://www.poreklo.rs/2020/04/10/istorijski-arhiv-31-januar-vranje/,,,,,,"NO ACCESS",,,,,
2167,"Матична књига венчаних",1893-1901,Врање,Врање,Ратајска,,"Архив Врање",,,,"Источна Србија","Црквене матичне књиге",,,https://www.poreklo.rs/2020/04/10/istorijski-arhiv-31-januar-vranje/,,,,,,"NO ACCESS",,,,,
2157,"Матична књига венчаних",1893-1910,Врање,Врање,,,"Архив Врање",,,,"Источна Србија","Црквене матичне књиге",,,https://www.poreklo.rs/2020/04/10/istorijski-arhiv-31-januar-vranje/,,,парохијска,,,"NO ACCESS",,,,,
2172,"Матична књига венчаних",1893-1915,Врање,Врање,Преображењска,,"Архив Врање",,,,"Источна Србија","Црквене матичне књиге",,,https://www.poreklo.rs/2020/04/10/istorijski-arhiv-31-januar-vranje/,,,"са Отуљом",,,"NO ACCESS",,,,,
2174,"Матична књига венчаних",1893-1915,Врање,Врање,Требешињска,,"Архив Врање",,,,"Источна Србија","Црквене матичне књиге",,,https://www.poreklo.rs/2020/04/10/istorijski-arhiv-31-januar-vranje/,,,парохијска,,,"NO ACCESS",,,,,
2175,"Матична књига венчаних",1893-1920,Врање,Врање,Требешињска,,"Архив Врање",,,,"Источна Србија","Црквене матичне књиге",,,https://www.poreklo.rs/2020/04/10/istorijski-arhiv-31-januar-vranje/,,,парохијска,,,"NO ACCESS",,,,,
2177,"Матична књига венчаних",1893-1920,Врање,Врање,Топлачка,,"Архив Врање",,,,"Источна Србија","Црквене матичне књиге",,,https://www.poreklo.rs/2020/04/10/istorijski-arhiv-31-januar-vranje/,,,,,,"NO ACCESS",,,,,
2181,"Матична књига венчаних",1893-1921,Врање,Врање,Тибушка,,"Архив Врање",,,,"Источна Србија","Црквене матичне књиге",,,https://www.poreklo.rs/2020/04/10/istorijski-arhiv-31-januar-vranje/,,,парохије,,,"NO ACCESS",,,,,
2183,"Матична књига венчаних",1899-1908,Врање,Врање,Клисурска,,"Архив Врање",,,,"Источна Србија","Црквене матичне књиге",,,https://www.poreklo.rs/2020/04/10/istorijski-arhiv-31-januar-vranje/,,,"Суви дол, Драјинци",,,"NO ACCESS",,,,,
1678,"Матична књига венчаних",1901-1908,Колари,Смедерево,,,"Историјски архив у Смедереву",,,,"Источна Србија","Црквене матичне књиге",,,https://www.poreklo.rs/2020/04/10/istorijski-arhiv-smederevo/,,,,,,"NO ACCESS",,,,,
1679,"Матична књига венчаних",1908-1828,Колари,Смедерево,,,"Историјски архив у Смедереву",,,,"Источна Србија","Црквене матичне књиге",,,https://www.poreklo.rs/2020/04/10/istorijski-arhiv-smederevo/,,,,,,"NO ACCESS",,,,,
2180,"Матична књига венчаних",1916,Врање,Врање,"Св Троице",,"Архив Врање",,,,"Источна Србија","Црквене матичне књиге",,,https://www.poreklo.rs/2020/04/10/istorijski-arhiv-31-januar-vranje/,,,"Панчевац, Кленике",,,"NO ACCESS",,,,,
2171,"Матична књига венчаних",1916-1918,Врање,Врање,Тесовишка,,"Архив Врање",,,,"Источна Србија","Црквене матичне књиге",,,https://www.poreklo.rs/2020/04/10/istorijski-arhiv-31-januar-vranje/,,,,,,"NO ACCESS",,,,,
1713,"Матична књига венчаних",1918-1919,Липе,Смедерево,,,"Историјски архив у Смедереву",,,,"Источна Србија","Црквене матичне књиге",,,https://www.poreklo.rs/2020/04/10/istorijski-arhiv-smederevo/,,,,,,"NO ACCESS",,,,,
1655,"Матична књига рођених",1836-1849,Колари,Смедерево,,,"Историјски архив у Смедереву",,,,"Источна Србија","Црквене матичне књиге",,,https://www.poreklo.rs/2020/04/10/istorijski-arhiv-smederevo/,,,,,,"NO ACCESS",,,,,
1715,"Матична књига рођених",1841-1846,Смедерево,Смедерево,,,"Историјски архив у Смедереву",,,,"Источна Србија","Црквене матичне књиге",,,https://www.poreklo.rs/2020/04/10/istorijski-arhiv-smederevo/,,,,,,"NO ACCESS",,,,,
1705,"Матична књига рођених",1845-1862,Липе,Смедерево,,,"Историјски архив у Смедереву",,,,"Источна Србија","Црквене матичне књиге",,,https://www.poreklo.rs/2020/04/10/istorijski-arhiv-smederevo/,,,,,,"NO ACCESS",,,,,
1716,"Матична књига рођених",1847-1851,Смедерево,Смедерево,,,"Историјски архив у Смедереву",,,,"Источна Србија","Црквене матичне књиге",,,https://www.poreklo.rs/2020/04/10/istorijski-arhiv-smederevo/,,,,,,"NO ACCESS",,,,,
1717,"Матична књига рођених",1850-1851,Смедерево,Смедерево,,,"Историјски архив у Смедереву",,,,"Источна Србија","Црквене матичне књиге",,,https://www.poreklo.rs/2020/04/10/istorijski-arhiv-smederevo/,,,,,,"NO ACCESS",,,,,
1656,"Матична књига рођених",1850-1856,Колари,Смедерево,,,"Историјски архив у Смедереву",,,,"Источна Србија","Црквене матичне књиге",,,https://www.poreklo.rs/2020/04/10/istorijski-arhiv-smederevo/,,,,,,"NO ACCESS",,,,,
1770,"Матична књига рођених",1850-1897,Биновац,Смедерево,,,"Историјски архив у Смедереву",,,,"Источна Србија","Црквене матичне књиге",,,https://www.poreklo.rs/2020/04/10/istorijski-arhiv-smederevo/,,,,,,"NO ACCESS",,,,,
1718,"Матична књига рођених",1851-1856,Смедерево,Смедерево,,,"Историјски архив у Смедереву",,,,"Источна Србија","Црквене матичне књиге",,,https://www.poreklo.rs/2020/04/10/istorijski-arhiv-smederevo/,,,,,,"NO ACCESS",,,,,
1657,"Матична књига рођених",1856-1861,Колари,Смедерево,,,"Историјски архив у Смедереву",,,,"Источна Србија","Црквене матичне књиге",,,https://www.poreklo.rs/2020/04/10/istorijski-arhiv-smederevo/,,,,,,"NO ACCESS",,,,,
1719,"Матична књига рођених",1856-1861,Смедерево,Смедерево,,,"Историјски архив у Смедереву",,,,"Источна Србија","Црквене матичне књиге",,,https://www.poreklo.rs/2020/04/10/istorijski-arhiv-smederevo/,,,,,,"NO ACCESS",,,,,
1697,"Матична књига рођених",1857-1872,Враново,Смедерево,,,"Историјски архив у Смедереву",,,,"Источна Србија","Црквене матичне књиге",,,https://www.poreklo.rs/2020/04/10/istorijski-arhiv-smederevo/,,,,,,"NO ACCESS",,,,,
1720,"Матична књига рођених",1861-1865,Смедерево,Смедерево,,,"Историјски архив у Смедереву",,,,"Источна Србија","Црквене матичне књиге",,,https://www.poreklo.rs/2020/04/10/istorijski-arhiv-smederevo/,,,,,,"NO ACCESS",,,,,
1658,"Матична књига рођених",1861-1866,Колари,Смедерево,,,"Историјски архив у Смедереву",,,,"Источна Србија","Црквене матичне књиге",,,https://www.poreklo.rs/2020/04/10/istorijski-arhiv-smederevo/,,,,,,"NO ACCESS",,,,,