book_id,title,author_or_editor,isbn,publisher,source,num_red,place,copyright_year,categories,audience,area,kind_of,media,thumbnail_url,info_url,reference_url,reference_no,notes,note_ii,status,borrower_id,due_date,date_created,date_modified,created_by,modified_by
2900,Срђ,1902-1908,Дубровник,,,,"Универзитетска библиотека ""Светозар Марковић""",,,General,Далмација,"Штампана издања","2 3",,,http://www.unilib.rs/istorijske-novine/pregled?category=PREWWI&newspaper=UB_00025,,"Часопис је излазио од 1902. до 1908, уређивао га Антун Фабрис, који је био оснивач и власник. Након његове смрти као уредници јављају се Михо Вакети, Крсто П. Доминковић и Антоније Вучетић. Часопис је излазио и ћирилично и латинично два пута месечно, и иако се сматрао српским гласилом, био је уређиван у духу југословенства. У њему су сарађивали сви познати културни, књижевни и научни радници Дубровника. Доносио је чланке из историје, књижевности, лингвистике, велики број литерарне прозе, стихова и превода, као и књижевне приказе. У часопису су сарађивали бројни научници и књижевници из свих српских крајева, а међу њима и Симо Матавуљ, Драгутин Домјанић, Иво Војновић… После анексије Босне и Херцеговине морао је престати са излажењем као српски часопис.","Претраживо у тексту",,"NO ACCESS",,,,arhivar3,Uzi
13946,Бренцуља,1901,Дубровник,,,,"Национална и свеучилишна књижница Загреб",,,General,Далмација,"Штампана издања","2 3",,,http://dnc.nsk.hr/newspapers/LibraryTitle.aspx?id=00924ffd-4110-4cc2-9e3d-bd45fc912c2a,,"Фољ за пазар. На латиници.","Претраживо у тексту",,"NO ACCESS",,,,arhivar1,Uzi
13947,Бумба,1909,Дубровник,,,,"Национална и свеучилишна књижница Загреб",,,General,Далмација,"Штампана издања","2 3",,,http://dnc.nsk.hr/newspapers/LibraryTitle.aspx?id=0199289d-185d-4a9f-80ec-328d1263e875,,"Издање и штампа Српске Дубровачке Штампарије Др. М. Грацића и др. На латиници.","Претраживо у тексту",,"NO ACCESS",,,,arhivar1,Uzi
13949,Чеп,1928-1937,Дубровник,,,,"Национална и свеучилишна књижница Загреб",,,General,Далмација,"Штампана издања","2 3",,,http://dnc.nsk.hr/newspapers/LibraryTitle.aspx?id=92bf7368-17b1-4353-a795-80443d695b51,,"фољ за складност и културну његу. На латиници.","Претраживо у тексту",,"NO ACCESS",,,,arhivar1,Uzi
13957,Дрнда,1934,Дубровник,,,,"Национална и свеучилишна књижница Загреб",,,General,Далмација,"Штампана издања","2 3",,,http://dnc.nsk.hr/newspapers/LibraryTitle.aspx?id=ced7496b-cba0-4657-97fb-b63e41f2aa7e&y=1934&m=2&d=2,,,"Претраживо у тексту",,"NO ACCESS",,,,arhivar1,Uzi
13959,Фералић,1933,Дубровник,,,,"Национална и свеучилишна књижница Загреб",,,General,Далмација,"Штампана издања","2 3",,,http://dnc.nsk.hr/newspapers/LibraryTitle.aspx?id=74fa1a83-487a-4b2f-a0a5-8afae605ccc8&y=1933&m=3&d=23,,,"Претраживо у тексту",,"NO ACCESS",,,,arhivar1,Uzi
13960,Фестањуо,1938-1940,Дубровник,,,,"Национална и свеучилишна књижница Загреб",,,General,Далмација,"Штампана издања","2 3",,,http://dnc.nsk.hr/newspapers/LibraryTitle.aspx?id=f50c3650-11d3-4f22-9f1f-86e87b65300d&y=1940&m=2&d=1,,"Фољ од пазара. На латиници.","Претраживо у тексту",,"NO ACCESS",,,,arhivar1,Uzi
13961,"Гласник далматински",1849-1866,Задар,,,,"Национална и свеучилишна књижница Загреб",,,General,Далмација,"Штампана издања","2 3",,,http://dnc.nsk.hr/newspapers/LibraryTitle.aspx?id=e3c3a99c-5dfb-49e6-a6eb-28c01dde2c74&y=1849&m=8&d=2,,"Службени лист аустријске управе у Далмацији. На латиници.","Претраживо у тексту",,"NO ACCESS",,,,arhivar1,Uzi
13963,Голуб,1919,Дубровник,,,,"Национална и свеучилишна књижница Загреб",,,General,Далмација,"Штампана издања","2 3",,,http://dnc.nsk.hr/newspapers/LibraryTitle.aspx?id=f7ad2894-61f1-4470-97bd-79ecc056ac99&y=1919&m=4&d=19,,,"Претраживо у тексту",,"NO ACCESS",,,,arhivar1,Uzi
13964,Гринтавац,1937,Дубровник,,,,"Национална и свеучилишна књижница Загреб",,,General,Далмација,"Штампана издања","2 3",,,http://dnc.nsk.hr/newspapers/LibraryTitle.aspx?id=333baf8d-b4de-42b5-b899-9d7ed6bc6a04&y=1937&m=5&d=5,,,"Претраживо у тексту",,"NO ACCESS",,,,arhivar1,Uzi
13965,Гризлица,1932,Дубровник,,,,"Национална и свеучилишна књижница Загреб",,,General,Далмација,"Штампана издања","2 3",,,http://dnc.nsk.hr/newspapers/LibraryTitle.aspx?id=e97822fd-5cbf-451f-89ba-c5b584b49a76&y=1932&m=3&d=26,,,"Претраживо у тексту",,"NO ACCESS",,,,arhivar1,Uzi
13974,Јаје,1935-1936,Дубровник,,,,"Национална и свеучилишна књижница Загреб",,,General,Далмација,"Штампана издања","2 3",,,http://dnc.nsk.hr/newspapers/LibraryTitle.aspx?id=8530d03a-04cb-4f36-8d01-16248c69661a&y=1935&m=3&d=2,,"Фој од пазара и смијеха","Претраживо у тексту",,"NO ACCESS",,,,arhivar1,Uzi
13975,Јеж,1920-1934,Дубровник,,,,"Национална и свеучилишна књижница Загреб",,,General,Далмација,"Штампана издања","2 3",,,http://dnc.nsk.hr/newspapers/LibraryTitle.aspx?id=78360c94-517b-4fb2-b7b0-8c09d194250c&y=1922&m=2&d=2,,,"Претраживо у тексту",,"NO ACCESS",,,,arhivar1,Uzi
13982,Кокот,1920,Дубровник,,,,,,,General,Далмација,"Штампана издања","2 3",,,http://dnc.nsk.hr/newspapers/LibraryTitle.aspx?id=d0c8ad82-4c6a-4fe2-b6a6-878de8d02bb8&y=1920&m=9&d=10,,"Штампано у Српској штампарији","Претраживо у тексту",,"NO ACCESS",,,,arhivar1,Uzi
13983,Клемпесало,1906,Дубровник,,,,"Дубровачке књижнице Дубровник",,,General,Далмација,"Штампана издања","2 3",,,http://dnc.nsk.hr/newspapers/LibraryTitle.aspx?id=32b2babd-e295-47ee-aec7-ce40ce93b26d&y=1906&m=2&d=11,,"Карневалске новине","Претраживо у тексту",,"NO ACCESS",,,,arhivar1,Uzi
13984,Колера,1936,Дубровник,,,,"Национална и свеучилишна књижница Загреб",,,General,Далмација,"Штампана издања","2 3",,,http://dnc.nsk.hr/newspapers/LibraryTitle.aspx?id=ba7812c9-1a2a-4206-8cd7-babdc2f5fbb1&y=1936&m=10&d=1,,,"Претраживо у тексту",,"NO ACCESS",,,,arhivar1,Uzi
13985,Комар,1919,Дубровник,,,,"Национална и свеучилишна књижница Загреб",,,General,Далмација,"Штампана издања","2 3",,,http://dnc.nsk.hr/newspapers/LibraryTitle.aspx?id=d9ad8981-e486-4419-b957-0af8340a58fb&y=1919&m=1&d=1,,,"Претраживо у тексту",,"NO ACCESS",,,,arhivar1,Uzi
13986,Криза,1934,Дубровник,,,,"Национална и свеучилишна књижница Загреб",,,General,Далмација,"Штампана издања","2 3",,,http://dnc.nsk.hr/newspapers/LibraryTitle.aspx?id=3d704b5f-cd33-40fe-ba79-9b255befa5fe&y=1934&m=2&d=10,,,"Претраживо у тексту",,"NO ACCESS",,,,arhivar1,Uzi
13987,Кундурица,1912-1936,Дубровник,,,,"Национална и свеучилишна књижница Загреб",,,General,Далмација,"Штампана издања","2 3",,,http://dnc.nsk.hr/newspapers/LibraryTitle.aspx?id=9c4b3cf4-acf4-489a-94eb-05d7f6b02298&y=1913&m=8&d=3,,"Фој за закинут","Претраживо у тексту",,"NO ACCESS",,,,arhivar1,Uzi
14007,Осињак,1919,Дубровник,,,,"Национална и свеучилишна књижница Загреб",,,General,Далмација,"Штампана издања","2 3",,,http://dnc.nsk.hr/newspapers/LibraryTitle.aspx?id=00eb483a-518a-4f1b-9fb4-2f3a1507506b&y=1919&m=4&d=17,,,"Претраживо у тексту",,"NO ACCESS",,,,arhivar1,Uzi
14008,Пчела,1920,Дубровник,,,,"Дубровачке књижнице Дубровник",,,General,Далмација,"Штампана издања","2 3",,,http://dnc.nsk.hr/newspapers/LibraryTitle.aspx?id=07d882dc-2b80-400e-bd01-a8f255daa34e&y=1920&m=11&d=18,,"Ванстраначки лист","Претраживо у тексту",,"NO ACCESS",,,,arhivar1,Uzi
14010,Правдоноша,1851-1852,Задар,,,,"Национална и свеучилишна књижница Загреб",,,General,Далмација,"Штампана издања","2 3",,,http://dnc.nsk.hr/newspapers/LibraryTitle.aspx?id=fec28a2e-7297-4daa-ad22-9f2d0aa0da00&y=1851&m=8&d=2,,Недељник,"Претраживо у тексту",,"NO ACCESS",,,,arhivar1,Uzi
14012,Прцулин,1910,Дубровник,,,,"Национална и свеучилишна књижница Загреб",,,General,Далмација,"Штампана издања","2 3",,,http://dnc.nsk.hr/newspapers/LibraryTitle.aspx?id=8c99a24f-afda-462a-b462-80dcbf569905&y=1910&m=1&d=28,,"Фољ за пазар","Претраживо у тексту",,"NO ACCESS",,,,arhivar1,Uzi
14015,Прндеј,1937,Дубровник,,,,"Дубровачке књижнице Дубровник",,,General,Далмација,"Штампана издања","2 3",,,http://dnc.nsk.hr/newspapers/LibraryTitle.aspx?id=e30393d8-7823-4d3b-bc37-6409a9ce9834&y=1937&m=2&d=3,,"Фој за свашта. Карневалске новине.","Претраживо у тексту",,"NO ACCESS",,,,arhivar1,Uzi
14016,Пуздро,1920,Дубровник,,,,"Национална и свеучилишна књижница Загреб",,,General,Далмација,"Штампана издања","2 3",,,http://dnc.nsk.hr/newspapers/LibraryTitle.aspx?id=c7581997-56ea-49f5-9a57-cc35c0b2eff3&y=1928&m=2&d=16,,,"Претраживо у тексту",,"NO ACCESS",,,,arhivar1,Uzi
14021,Сиђелица,1934,Дубровник,,,,"Национална и свеучилишна књижница Загреб",,,General,Далмација,"Штампана издања","2 3",,,http://dnc.nsk.hr/newspapers/LibraryTitle.aspx?id=80656c6e-c27f-429b-9d3f-0a6ee4830d50&y=1934&m=1&d=27,,,"Претраживо у тексту",,"NO ACCESS",,,,arhivar1,Uzi
14022,Скандалет,1911,Дубровник,,,,"Национална и свеучилишна књижница Загреб",,,General,Далмација,"Штампана издања","2 3",,,http://dnc.nsk.hr/newspapers/LibraryTitle.aspx?id=ea43292e-84cb-4b81-a0b4-60df2842a59e&y=1911&m=2&d=23,,,"Претраживо у тексту",,"NO ACCESS",,,,arhivar1,Uzi
14027,Словинац,1878-1884,Дубровник,,,,"Национална и свеучилишна књижница Загреб",,,General,Далмација,"Штампана издања","2 3",,,http://dnc.nsk.hr/newspapers/LibraryTitle.aspx?id=152b2c3a-2360-4d03-8337-37efe0d5d4be&y=1884&m=6&d=21,,"Лист за књигу, умјетност и обртност","Претраживо у тексту",,"NO ACCESS",,,,arhivar1,Uzi
14028,Сотомарин,1937,Дубровник,,,,"Национална и свеучилишна књижница Загреб",,,General,Далмација,"Штампана издања","2 3",,,http://dnc.nsk.hr/newspapers/LibraryTitle.aspx?id=82ec9ec9-51d6-474f-8799-e273b43c45f3&y=1937&m=1&d=31,,,"Претраживо у тексту",,"NO ACCESS",,,,arhivar1,Uzi
14035,"Зора далматинска",1844-1849,Задар,,,,"Национална и свеучилишна књижница Загреб",,,General,Далмација,"Штампана издања","2 3",,,http://dnc.nsk.hr/newspapers/LibraryTitle.aspx?id=1485c980-43bd-4e00-8d9b-3be35378d48b&y=1844&m=5&d=27,,"Књижевно-просветни недељник","Претраживо у тексту",,"NO ACCESS",,,,arhivar1,Uzi
14036,Звижда,1933,Дубровник,,,,"Национална и свеучилишна књижница Загреб",,,General,Далмација,"Штампана издања","2 3",,,http://dnc.nsk.hr/newspapers/LibraryTitle.aspx?id=56abb533-2b15-407a-b9a2-f7f6f558684e&y=1933&m=5&d=13,,,"Претраживо у тексту",,"NO ACCESS",,,,arhivar1,Uzi
9708,Индекс,1924-1933,Лабин,,,I1924-1933,"Матични уред Лабин",,"Државне матичне књиге",,Далмација,Индекси,,DEL,,,HRA-06182-1,"Казало рођених",,,"NO ACCESS",,,,arhivar1,Uzi
9749,Индекс,1924-1933,Лабин,,,I1924-1933,"Матични уред Лабин",,"Државне матичне књиге",,Далмација,Индекси,,DEL,,,HRA-06223-1,"Казало вјенчаних",,,"NO ACCESS",,,,arhivar1,Uzi
9750,Индекс,1924-1933,Лабин,,,I1924-1933,"Матични уред Лабин",,"Државне матичне књиге",,Далмација,Индекси,,DEL,,,HRA-06224-1,"Казало вјенчаних",,,"NO ACCESS",,,,arhivar1,Uzi
9784,Индекс,1924-1933,Лабин,,,I1924-1933,"Матични уред Лабин",,"Државне матичне књиге",,Далмација,Индекси,,DEL,,,HRA-06258-1,"Казало умрлих",,,"NO ACCESS",,,,arhivar1,Uzi
9746,Индекс,1959-1962,Лабин,,,I1959-1962,"Матични уред Лабин",,"Државне матичне књиге",,Далмација,Индекси,,DEL,,,HRA-06220-1,"Казало рођених",,,"NO ACCESS",,,,arhivar1,Uzi
9780,Индекс,1959-1962,Лабин,,,I1959-1962,"Матични уред Лабин",,"Државне матичне књиге",,Далмација,Индекси,,DEL,,,HRA-06254-1,"Казало вјенчаних",,,"NO ACCESS",,,,arhivar1,Uzi
9812,Индекс,1959-1983,Лабин,,,I1959-1983,"Матични уред Лабин",,"Државне матичне књиге",,Далмација,Индекси,,DEL,,,HRA-06286-1,"Казало умрлих",,,"NO ACCESS",,,,arhivar1,Uzi
5598,"Матична књига рођених",1812-1812,Задар,,,R1812-1812,"Државни архив у Задру",,"Државне матичне књиге",,Далмација,"Црквене матичне књиге",,,,,HRA-02308-1,,,,"NO ACCESS",,,,arhivar1,Uzi
5601,"Матична књига рођених",1813-1814,Задар,,,R1813-1814,"Државни архив у Задру",,"Државне матичне књиге",,Далмација,"Црквене матичне књиге",,,,,HRA-02309-1,,,,"NO ACCESS",,,,arhivar1,Uzi
5607,"Матична књига рођених",1825-1830,Загвозд,,,R1825-1830,"Државни архив у Задру",,"Државне матичне књиге",,Далмација,"Црквене матичне књиге",,,,,HRA-02313-1,,,,"NO ACCESS",,,,arhivar1,Uzi
6799,"Матична књига рођених",1848-1952,Глогово,,,R1848-1952,"Матични уред Грачац",,"Државне матичне књиге",,Далмација,"Црквене матичне књиге",,,,,HRA-03407-1,"Скенови се налазе и на ДВД-у 142.",,,"NO ACCESS",,,,arhivar1,Uzi
6861,"Матична књига рођених",1849/1938,Омсица,,,R1849/1938,"Матични уред Грачац",,"Државне матичне књиге",,Далмација,"Црквене матичне књиге",,,,,HRA-03468-1,"Матица обухваћа године:1849, 1864, 1875, 1879, 1882, 1886, 1889, 1900, 1914, 1916, 1918-1933, 1938.",,,"NO ACCESS",,,,arhivar1,Uzi
6865,"Матична књига рођених",1864-1949,Осредци,,,R1864-1949,"Матични уред Грачац",,"Државне матичне књиге",,Далмација,"Црквене матичне књиге",,,,,HRA-03472-1,,,,"NO ACCESS",,,,arhivar1,Uzi
6866,"Матична књига рођених",1864-1949,Осредци,,,R1864-1949,"Матични уред Грачац",,"Државне матичне књиге",,Далмација,"Црквене матичне књиге",,,,,HRA-03473-1,,,,"NO ACCESS",,,,arhivar1,Uzi
6859,"Матична књига рођених",1868/1950,Нетека,,,R1868/1950,"Матични уред Грачац",,"Државне матичне књиге",,Далмација,"Црквене матичне књиге",,,,,HRA-03466-1,"Матица обухваћа године: 1868, 1871, 1881, 1886, 1894, 1896, 1909, 1910, 1921, 1923, 1926, 1927, 1930-1936, 1938-1950.",,,"NO ACCESS",,,,arhivar1,Uzi
6974,"Матична књига рођених",1870-1952,Томингај,,,R1870-1952,"Матични уред Грачац",,"Државне матичне књиге",,Далмација,"Црквене матичне књиге",,,,,HRA-03581-1,,,,"NO ACCESS",,,,arhivar1,Uzi
6995,"Матична књига рођених",1871-1951,"Велика Попина",,,R1871-1951,"Матични уред Грачац",,"Државне матичне књиге",,Далмација,"Црквене матичне књиге",,,,,HRA-03602-1,,,,"NO ACCESS",,,,arhivar1,Uzi
6871,"Матична књига рођених",1876-1947,Отрић,,,R1876-1947,"Матични уред Грачац",,"Државне матичне књиге",,Далмација,"Црквене матичне књиге",,,,,HRA-03478-1,,,,"NO ACCESS",,,,arhivar1,Uzi
6996,"Матична књига рођених",1877-1952,"Велика Попина",,,R1877-1952,"Матични уред Грачац",,"Државне матичне књиге",,Далмација,"Црквене матичне књиге",,,,,HRA-03603-1,,,,"NO ACCESS",,,,arhivar1,Uzi
6872,"Матична књига рођених",1878-1952,Отрић,,,R1878-1952,"Матични уред Грачац",,"Државне матичне књиге",,Далмација,"Црквене матичне књиге",,,,,HRA-03479-1,,,,"NO ACCESS",,,,arhivar1,Uzi
6873,"Матична књига рођених",1878-1952,Отрић,,,R1878-1952,"Матични уред Грачац",,"Државне матичне књиге",,Далмација,"Црквене матичне књиге",,,,,HRA-03480-1,,,,"NO ACCESS",,,,arhivar1,Uzi
12070,"Матична књига рођених",1879-1899,Триљ,,,R1879-1899,"Матични уред Триљ",,"Државне матичне књиге",,Далмација,"Црквене матичне књиге",,,,,HRA-08512-1,,,,"NO ACCESS",,,,arhivar1,Uzi
12071,"Матична књига рођених",1879-1899,Триљ,,,R1879-1899,"Матични уред Триљ",,"Државне матичне књиге",,Далмација,"Црквене матичне књиге",,,,,HRA-08513-1,,,,"NO ACCESS",,,,arhivar1,Uzi
6924,"Матична књига рођених",1879-1950,Срб,,,R1879-1950,"Матични уред Грачац",,"Државне матичне књиге",,Далмација,"Црквене матичне књиге",,,,,HRA-03531-1,,,,"NO ACCESS",,,,arhivar1,Uzi
7007,"Матична књига рођених",1879-1950,Заклопац,,,R1879-1950,"Матични уред Грачац",,"Државне матичне књиге",,Далмација,"Црквене матичне књиге",,,,,HRA-03614-1,,,,"NO ACCESS",,,,arhivar1,Uzi
6862,"Матична књига рођених",1879-1952,Омсица,,,R1879-1952,"Матични уред Грачац",,"Државне матичне књиге",,Далмација,"Црквене матичне књиге",,,,,HRA-03469-1,,,,"NO ACCESS",,,,arhivar1,Uzi
6925,"Матична књига рођених",1881-1952,Срб,,,R1881-1952,"Матични уред Грачац",,"Државне матичне књиге",,Далмација,"Црквене матичне књиге",,,,,HRA-03532-1,,,,"NO ACCESS",,,,arhivar1,Uzi
6926,"Матична књига рођених",1881-1952,Срб,,,R1881-1952,"Матични уред Грачац",,"Државне матичне књиге",,Далмација,"Црквене матичне књиге",,,,,HRA-03533-1,,,,"NO ACCESS",,,,arhivar1,Uzi
6476,"Матична књига рођених",1894-1909,Лозовац,,,R1894-1909,"Државни архив у Задру и Сплиту",,"Државне матичне књиге",,Далмација,"Црквене матичне књиге",,,,,HRA-03090-1,,,,"NO ACCESS",,,,arhivar1,Uzi
6907,"Матична књига рођених",1900-1902,Срб,,,R1900-1902,"Матични уред Грачац",,"Државне матичне књиге",,Далмација,"Црквене матичне књиге",,,,,HRA-03514-1,,,,"NO ACCESS",,,,arhivar1,Uzi
6947,"Матична књига рођених",1900-1904,Томингај,,,R1900-1904,"Матични уред Грачац",,"Државне матичне књиге",,Далмација,"Црквене матичне књиге",,,,,HRA-03554-1,,,,"NO ACCESS",,,,arhivar1,Uzi
12067,"Матична књига рођених",1900-1905,Воштане,,,R1900-1905,"Матични уред Триљ",,"Државне матичне књиге",,Далмација,"Црквене матичне књиге",,,,,HRA-08509-1,,,,"NO ACCESS",,,,arhivar1,Uzi
6769,"Матична књига рођених",1900-1907,Брувно,,,R1900-1907,"Матични уред Грачац",,"Државне матичне књиге",,Далмација,"Црквене матичне књиге",,,,,HRA-03377-1,,,,"NO ACCESS",,,,arhivar1,Uzi
12154,"Матична књига рођених",1900-1907,Зрмања,,,R1900-1907,"Матични уред Грачац",,"Државне матичне књиге",,Далмација,"Црквене матичне књиге",,,,,HRA-08594-1,,,,"NO ACCESS",,,,arhivar1,Uzi
6845,"Матична књига рођених",1900-1908,Мазин,,,R1900-1908,"Матични уред Грачац",,"Државне матичне књиге",,Далмација,"Црквене матичне књиге",,,,,HRA-03452-1,,,,"NO ACCESS",,,,arhivar1,Uzi
6990,"Матична књига рођених",1900-1911,"Велика Попина",,,R1900-1911,"Матични уред Грачац",,"Државне матичне књиге",,Далмација,"Црквене матичне књиге",,,,,HRA-03597-1,,,,"NO ACCESS",,,,arhivar1,Uzi
12072,"Матична књига рођених",1900-1913,Триљ,,,R1900-1913,"Матични уред Триљ",,"Државне матичне књиге",,Далмација,"Црквене матичне књиге",,,,,HRA-08514-1,,,,"NO ACCESS",,,,arhivar1,Uzi
12065,"Матична књига рођених",1900-1916,Стризиреп,,,R1900-1916,"Матични уред Триљ",,"Државне матичне књиге",,Далмација,"Црквене матичне књиге",,,,,HRA-08507-1,,,,"NO ACCESS",,,,arhivar1,Uzi
12064,"Матична књига рођених",1900-1939,Роже,,,R1900-1939,"Матични уред Триљ",,"Државне матичне књиге",,Далмација,"Црквене матичне књиге",,,,,HRA-08506-1,,,,"NO ACCESS",,,,arhivar1,Uzi
12069,"Матична књига рођених",1900-1939,Биско,,,R1900-1939,"Матични уред Триљ",,"Државне матичне књиге",,Далмација,"Црквене матичне књиге",,,,,HRA-08511-1,,,,"NO ACCESS",,,,arhivar1,Uzi
6908,"Матична књига рођених",1902-1905,Срб,,,R1902-1905,"Матични уред Грачац",,"Државне матичне књиге",,Далмација,"Црквене матичне књиге",,,,,HRA-03515-1,,,,"NO ACCESS",,,,arhivar1,Uzi
6909,"Матична књига рођених",1905-1907,Срб,,,R1905-1907,"Матични уред Грачац",,"Државне матичне књиге",,Далмација,"Црквене матичне књиге",,,,,HRA-03516-1,,,,"NO ACCESS",,,,arhivar1,Uzi
6948,"Матична књига рођених",1905-1910,Томингај,,,R1905-1910,"Матични уред Грачац",,"Државне матичне књиге",,Далмација,"Црквене матичне књиге",,,,,HRA-03555-1,,,,"NO ACCESS",,,,arhivar1,Uzi
6949,"Матична књига рођених",1905-1910,Томингај,,,R1905-1910,"Матични уред Грачац",,"Државне матичне књиге",,Далмација,"Црквене матичне књиге",,,,,HRA-03556-1,,,,"NO ACCESS",,,,arhivar1,Uzi
12068,"Матична књига рођених",1905-1939,Воштане,,,R1905-1939,"Матични уред Триљ",,"Државне матичне књиге",,Далмација,"Црквене матичне књиге",,,,,HRA-08510-1,,,,"NO ACCESS",,,,arhivar1,Uzi
6992,"Матична књига рођених",1906/1930,"Велика Попина",,,R1906/1930,"Матични уред Грачац",,"Државне матичне књиге",,Далмација,"Црквене матичне књиге",,,,,HRA-03599-1,"Матица обухваћа године: 1906, 1908, 1921-1930.",,,"NO ACCESS",,,,arhivar1,Uzi
6993,"Матична књига рођених",1906/1930,"Велика Попина",,,R1906/1930,"Матични уред Грачац",,"Државне матичне књиге",,Далмација,"Црквене матичне књиге",,,,,HRA-03600-1,"Матица обухваћа године: 1906, 1908, 1921-1930.",,,"NO ACCESS",,,,arhivar1,Uzi
6910,"Матична књига рођених",1907-1907,Срб,,,R1907-1907,"Матични уред Грачац",,"Државне матичне књиге",,Далмација,"Црквене матичне књиге",,,,,HRA-03517-1,,,,"NO ACCESS",,,,arhivar1,Uzi
6770,"Матична књига рођених",1907-1919,Брувно,,,R1907-1919,"Матични уред Грачац",,"Државне матичне књиге",,Далмација,"Црквене матичне књиге",,,,,HRA-03378-1,,,,"NO ACCESS",,,,arhivar1,Uzi
6771,"Матична књига рођених",1907-1919,Брувно,,,R1907-1919,"Матични уред Грачац",,"Државне матичне књиге",,Далмација,"Црквене матичне књиге",,,,,HRA-03379-1,,,,"NO ACCESS",,,,arhivar1,Uzi
6911,"Матична књига рођених",1908-1910,Срб,,,R1908-1910,"Матични уред Грачац",,"Државне матичне књиге",,Далмација,"Црквене матичне књиге",,,,,HRA-03518-1,,,,"NO ACCESS",,,,arhivar1,Uzi
12155,"Матична књига рођених",1908-1916,Зрмања,,,R1908-1916,"Матични уред Грачац",,"Државне матичне књиге",,Далмација,"Црквене матичне књиге",,,,,HRA-08595-1,,,,"NO ACCESS",,,,arhivar1,Uzi
6846,"Матична књига рођених",1908-1920,Мазин,,,R1908-1920,"Матични уред Грачац",,"Државне матичне књиге",,Далмација,"Црквене матичне књиге",,,,,HRA-03453-1,,,,"NO ACCESS",,,,arhivar1,Uzi
6847,"Матична књига рођених",1908-1920,Мазин,,,R1908-1920,"Матични уред Грачац",,"Државне матичне књиге",,Далмација,"Црквене матичне књиге",,,,,HRA-03454-1,,,,"NO ACCESS",,,,arhivar1,Uzi
6912,"Матична књига рођених",1910-1912,Срб,,,R1910-1912,"Матични уред Грачац",,"Државне матичне књиге",,Далмација,"Црквене матичне књиге",,,,,HRA-03519-1,,,,"NO ACCESS",,,,arhivar1,Uzi
6950,"Матична књига рођених",1910-1915,Томингај,,,R1910-1915,"Матични уред Грачац",,"Државне матичне књиге",,Далмација,"Црквене матичне књиге",,,,,HRA-03557-1,,,,"NO ACCESS",,,,arhivar1,Uzi
6991,"Матична књига рођених",1912-1921,"Велика Попина",,,R1912-1921,"Матични уред Грачац",,"Државне матичне књиге",,Далмација,"Црквене матичне књиге",,,,,HRA-03598-1,,,,"NO ACCESS",,,,arhivar1,Uzi
6913,"Матична књига рођених",1913-1915,Срб,,,R1913-1915,"Матични уред Грачац",,"Државне матичне књиге",,Далмација,"Црквене матичне књиге",,,,,HRA-03520-1,,,,"NO ACCESS",,,,arhivar1,Uzi
12073,"Матична књига рођених",1913-1927,Триљ,,,R1913-1927,"Матични уред Триљ",,"Државне матичне књиге",,Далмација,"Црквене матичне књиге",,,,,HRA-08515-1,,,,"NO ACCESS",,,,arhivar1,Uzi
6914,"Матична књига рођених",1915-1920,Срб,,,R1915-1920,"Матични уред Грачац",,"Државне матичне књиге",,Далмација,"Црквене матичне књиге",,,,,HRA-03521-1,,,,"NO ACCESS",,,,arhivar1,Uzi
6951,"Матична књига рођених",1915-1922,Томингај,,,R1915-1922,"Матични уред Грачац",,"Државне матичне књиге",,Далмација,"Црквене матичне књиге",,,,,HRA-03558-1,,,,"NO ACCESS",,,,arhivar1,Uzi
12156,"Матична књига рођених",1916-1925,Зрмања,,,R1916-1925,"Матични уред Грачац",,"Државне матичне књиге",,Далмација,"Црквене матичне књиге",,,,,HRA-08596-1,,,,"NO ACCESS",,,,arhivar1,Uzi
6772,"Матична књига рођених",1919-1926,Брувно,,,R1919-1926,"Матични уред Грачац",,"Државне матичне књиге",,Далмација,"Црквене матичне књиге",,,,,HRA-03380-1,,,,"NO ACCESS",,,,arhivar1,Uzi
6923,"Матична књига рођених",1919/1938,Срб,,,R1919/1938,"Матични уред Грачац",,"Државне матичне књиге",,Далмација,"Црквене матичне књиге",,,,,HRA-03530-1,"Матица обухваћа године: 1919, 1937, 1938.",,,"NO ACCESS",,,,arhivar1,Uzi
6915,"Матична књига рођених",1920-1922,Срб,,,R1920-1922,"Матични уред Грачац",,"Државне матичне књиге",,Далмација,"Црквене матичне књиге",,,,,HRA-03522-1,,,,"NO ACCESS",,,,arhivar1,Uzi
6916,"Матична књига рођених",1920-1922,Срб,,,R1920-1922,"Матични уред Грачац",,"Државне матичне књиге",,Далмација,"Црквене матичне књиге",,,,,HRA-03523-1,,,,"NO ACCESS",,,,arhivar1,Uzi
6741,"Матична књига рођених",1920-1928,Мазин,,,R1920-1928,"Матични уред Грачац",,"Државне матичне књиге",,Далмација,"Црквене матичне књиге",,,,,HRA-03349-1,,,,"NO ACCESS",,,,arhivar1,Uzi
6952,"Матична књига рођених",1921-1926,Томингај,,,R1921-1926,"Матични уред Грачац",,"Државне матичне књиге",,Далмација,"Црквене матичне књиге",,,,,HRA-03559-1,,,,"NO ACCESS",,,,arhivar1,Uzi
6953,"Матична књига рођених",1921-1926,Томингај,,,R1921-1926,"Матични уред Грачац",,"Државне матичне књиге",,Далмација,"Црквене матичне књиге",,,,,HRA-03560-1,,,,"NO ACCESS",,,,arhivar1,Uzi
6917,"Матична књига рођених",1923-1925,Срб,,,R1923-1925,"Матични уред Грачац",,"Државне матичне књиге",,Далмација,"Црквене матичне књиге",,,,,HRA-03524-1,,,,"NO ACCESS",,,,arhivar1,Uzi
7026,"Матична књига рођених",1924-1924,Задар,,,R1924-1924,"Матични уред Задар",,"Државне матичне књиге",,Далмација,"Црквене матичне књиге",,,,,HRA-03633-1,,,,"NO ACCESS",,,,arhivar1,Uzi
9709,"Матична књига рођених",1924-1924,Лабин,,,R1924-1924,"Матични уред Лабин",,"Државне матичне књиге",,Далмација,"Црквене матичне књиге",,DEL,,,HRA-06183-1,,,,"NO ACCESS",,,,arhivar1,Uzi